{"text_format":"1","workbook":"xlsx","n_sheets":8,"sheets":["Version","Création CRE TI CB","Feuil13","Création CRE TI VMC","Création CRE IMP","Création CRE IMP RT","Listes déroulantes","Code motif impayé"],"not_rendered":{"charts":0,"images":0,"macros":1,"external_links":1,"defined_names":8,"comments":2,"pivot_tables":0},"unopened":[],"bounds":{"document_bytes":16777216,"sheet_cells":100000,"rows_first":2000,"rows_last":500,"rows_between":2000,"halvings":0,"cell_chars":16384,"cell_head_chars":4096},"cells_cut":0,"cells_raw":0,"read":"whole","date_system":"1900"}

{"sheet":"Version","index":0,"n_rows":22,"n_cols":5,"rows_kept":22,"cut":false,"hidden":false,"merged":[]}
["Specification du document de référence","Version","Qui","Date"]
["EP_MONEXT_SFD_COMPTA_ CRE_V1O_16042021.xlsx","V1O","A.LATAT","2021-06-30"]
["EP_MONEXT_SFD_COMPTA_ CRE_V1O_21072021.xlsx","V10.1","S. Mougeolle","2021-07-21","Correction dans la creaton CTRE TI VMC ( erreur dans la concaténation des zones)"]
["EP_MONEXT_SFD_COMPTA_ CRE_V1O_21072021.xlsx","V10.2","S. Mougeolle","2021-07-26","Ajouts des clients utilisés pour le R7 RMFEC CB dans l'onglet Liste déroulante"]
["EP_MONEXT_SFD_COMPTA_ CRE_V1O_21072021.xlsx","V10.3","S. Mougeolle","2021-07-26","Ajouts dans les données à saisir sur l'onglet CREATION CRE TI CB\n'- Montant commission commerçant MTTTCITR \n'- Montant Scheme Fee ( Non présent dans le CRE - Toujours = 0)"]
[null,"V10.3","S. Mougeolle","2021-07-26","Ajouts dans les données à saisir sur l'onglet CREATION CRE TI VMCde \n'- Montant commission commerçant MTTTCITR \n'- Montant commission banque Visa/ Mastercard MTBQVMC"]
[null,null,null,null,"Note 1 : Problémaique des décimales ( Au délà de 2 décimales dans un montant commission, l'outil ne fonctionne pas"]
[null,null,null,null,"Note 2 : NUARN n'est pas paddé correctement et trop de caractère "]
[null,"V10.41","S. Mougeolle / Theodoros ZAMPETOGLOU","2021-07-28","Ajouts des clients utilisés pour le R7 RMFEC CB dans l'onglet Liste déroulante"]
[null,"V10.42","S. Mougeolle ","2021-07-28","Correction de alimentation de IDREM p477 pour CB et VMC ( No de remise différent pour Paiement et Remboursement ) "]
[null,"V10.43","S. Mougeolle ","2021-08-04","Correction liste déroulante M36 à M40\nCorrection dans l'onglet Creation CRE TI VMC de la generation des zones MTINTVMC /MTRVMC/MTBQVMC sur 5 décimales ( et non sur 4) "]
[null,"V10.44","S. Mougeolle / Theodoros ZAMPETOGLOU","2021-08-05","Ajouts des clients utilisés pour le R7 RMFEC dans l'onglet Liste déroulante"]
[null,"V10.47","S. Mougeolle ","2021-10-11","Correction création CRE  Impayé\nCreation onglet création CRE Impayé RT"]
[null,"V10.48","S. Mougeolle ","2021-10-21","Ajout du contrat CM_16_RMFEC VAD2 dans la liste déroulante "]
[null,"V10.48(3)","S. Mougeolle ","2022-01-01","Ajoute des frais de rejet impayé RT"]
[null,"V10.49 (xlsm)","P Fernandez","2022-03-30","Ajout bouton création de fichier"]
[null,"V10.53","S. Mougeolle ","2022-06-13","Modification IDRemise sur tous les onglets afin de mieux coller à la prod"]
[null,"V10.57","S. Mougeolle / A. PELTIER","2022-12-06","Ajout commission agent"]
[null,"V10.71","P Fernandez","2022-12-19","correctif nom impayé"]
[null,"V10,8","S. Mougeolle ","2025-10-20","MAJ de l'onglet CRE TI CB sur le format des CRE \n+ Ajouts de 11 nouveaux clients dans la liste déroulante"]
[null,null,null,"2025-10-23","Verif les MAJ de l'onglet CRE TI VMC "]
[null,null,null,null,"RAF Verif les MAJ de l'onglet CRE IMP CB/VMC "]

{"sheet":"Création CRE TI CB","index":1,"n_rows":100,"n_cols":171,"rows_kept":100,"cut":false,"hidden":false,"merged":[[0,0,0,3]]}
["CRE CONCATENE (données de sortie)",null,null,null,"DONNEES PARAMETRABLE (données en entrée)",null,null,null,null,null,null,null,null,null,null,null,"CRE DECOUPE (détails intermédiaires)"]
[null,null,null,null,null,null,null,null,null,null,null,null,null,null,null,"Début",1,3,9,11,16,21,23,26,30,32,34,35,40,45,64,72,87,103,106,107,110,111,134,137,145,165,167,170,190,202,206,207,212,217,228,230,233,239,249,252,286,289,291,307,328,352,358,364,369,385,401,402,406,414,426,438,439,444,463,471,477,502,541,542,543,546,553,558,658,670,682,694,698,711,761,782]
[null,null,null,null,null,null,null,null,null,null,null,null,null,null,null,"Lg",2,6,2,5,5,2,3,4,2,2,1,5,5,19,8,15,16,3,1,3,1,23,3,8,20,2,3,20,12,4,1,5,5,11,2,3,6,10,3,34,3,2,16,21,24,6,6,5,16,16,1,4,8,12,12,1,5,19,8,6,25,39,1,1,3,7,5,100,12,12,12,4,13,50,21,220]
[null,null,null,null,null,null,null,null,null,null,null,null,null,null,null,"Specification","« 14 »","« 000000 »","Domestique (CB) : \n« Z0 » : Transaction initiale\n« Z1 » : Impayés reçus","Code banque de domiciliation du porteur","Code banque gestionnaire du commerçant","« XA »","TRI si S04 = « 100 », « 101 », « 102 » ou « 140 » \nATI si S04 = \"400\", \"402\", \"408\"\nTRI : Transaction Initiale \nATI : Annulation de la TI ","Spaces",0,0,"1 : Porteur\n2 : Commerçant\n3 : Produit Financier ","Code établissement gestionnaire de l’acquéreur","Code guichet de l’acquéreur issu de la télécollecte","Numéro de carte porteur : si généré en 16 caractères alors paddé à droite avec les espaces \nPAN est tokénisé","Date de vente au format SSAAMMJJ","Numéro SIRET commerçant","2 décimales, pas de séparateur","Code 978 pour l'euro ","« 2 »","TI : Transaction Initiale \nIM : Impayé\nRP : représentation d'impayé ","\n« S » pour Doméstique CB","RFARNO cadré à gauche","FAC : Paiement achat\nCAS : Retrait cash\nDAB : Retrait Dab\nAVO : Avoir\nA compléter pour les AOCT","SSAAMMJJ","Localisation","Les 2 premières positions de la zone DATA-B20-DD16 du fichier CB2C en sortie","Code pays du système d’acceptation","Les 20 premières positions de la zone DATA-B17-DD18 du fichier CB2C en sortie","que pour l'impayé ","Motif de l’impayé dans la codification du format de compensation reçu.","1 : first chargeback  2 : second chargeback","Code banque issu du référentiel commerçant par rapport au SIRET","Code siège du RIB issu du référentiel commerçant par rapport au SIRET","Numéro de compte du RIB issu du référentiel commerçant par rapport au SIRET  ","Clé RIB","TRCA-NUTPTR           ","spaces","N° cotrat commerçant issu du référentiel commerçant par rapport au SIRET","espaces","espaces","978 pour euro","« 2 »","Montant compensé = Montant brut de la transaction – Commission d’Interchange","A blanc sauf pour CRE IMP","Issu du référentiel commerçant par rapport au SIRET  ","Format : JJMMAA","Donnée uniquement pour les remises commerçant ou retrait","Donnée uniquement pour les remises commerçant ou retrait","16 caractères, 2 décimales sans séparateur","16 caractères, 2 décimales sans séparateur","Code usage","« LMA » si géré dans LMA","Date de la transaction mis sous le format SSAAMMJJ","2 décimales paddés à gauche","2 décimales paddés à gauche","spaces","Code établissement gestionnaire de l’acquéreur","Numéro de carte porteur : si généré du 16 caractères, complété par des blancs","Date d’enregistrement de la transaction dans les tables au format SSAAMMJJ","Numéro attribué à l’impayé : ce numéro est crée par LMA lors de la prise en compte de l’impayé","Identifiant de remise issue de l’header CB2C (composé de 000001+DTVEN+MONEXT+5espaces)","Filler","C - Usage Crédit\nD - Usage Débit\nP - Usage Prépayé\nU - Usage Universel\nb - Indéterminée (à blanc)","P - Compte Particulier\nE - Compte Entreprise\nb - Indéterminée (à blanc)","France: FRA\nUnion européenne (27 pays sans la France) ; l’évolution de cette liste doit être prévue : UE\nHors Union européenne : HUE","Filler VMC","INC - inconnu  \nPDP - proxi avec contact \nPDPSC -  proxi sans contact\nVAD - vente à distance ","Filler","Champ 37 du CB2A fichier","Filler","Montant de la commission agent ","Filler","Filler","Filler","Filler","Filler"]
[null,null,null,null,null,null,null,null,null,null,null,null,null,null,null,"Libellé","Code type d’enregistrement","Numéro séquentiel","Code opération","Code banque émetteur","Code banque destinataire","Code application échange","Code sous application","Spaces","Code origine flux","Code destination flux","Code nature de flux comptable","Code établissement","Guichet accepteur","Numéro de carte","Date de vente","SIRET","Montant brut","Devise de réconciliation nationale liée au montant brut","Nombre de décimales du montant brut","Type opération","Code réseau","Référence archivage","Code opération interne","Date de règlement interbancaire","Localisation","Code département","Code pays","Raison sociale","Référence impayé reçue","Motif impayé","Code cycle impayé","Code établissement du RIB","Code Guichet du RIB ","Numéro de compte","Clé RIB","Numéro de terminal","Filler","Numéro de contrat accepteur","Code ICA","IBAN","Devise du montant compensé","nombre décimal mt compensé","Montant compensé","Référence externe","Nom du commerçant","Date de Valeur","Nombre de factures","Numéro de remise","Montant net","Montant brut en euro","Code usage","Mode de Traitement du Litige","Date envoi en compensation","Montant commission commerçant ","Montant commission Interchange CB","Type de porteur","code établissement","Numéro de carte","Date archivage","Numéro séquentiel","Identifiant de Remise","Filler","Code nature carte ","Code type carte ","Zone géographique ","Filler","Type application carte ","FILLER","Référence d'archivage Payline","FILLER","MTCOAG","FILLER","FILLER","FILLER","FILLER","FILLER"]
["Mode d'alimentation de ce fichier","Non actif si nb de ligne suffisante","à copier/coller dans NotePad","Données fixes","Variable à saisir JJ/MM/AAAA","Données fixes","Variable liste déroulante","Variable à saisir 0,00","Variable à saisir 0,00","Variable à saisir 0,00","Variable à saisir 0,00","Variable à saisir 0,00","Variable liste déroulante","Variable liste déroulante","Variable liste déroulante","Mode d'alimentation de ce fichier","FIXE","FIXE","FIXE","FIXE","FIXE","FIXE","FIXE","FIXE","FIXE","FIXE","FIXE","FIXE","FIXE","FIXE","DEDUITE","DEDUITE","DEDUITE","FIXE","FIXE","FIXE","FIXE","FIXE","FIXE","DEDUITE","FIXE","FIXE","FIXE","DEDUITE","FIXE","FIXE","FIXE","FIXE","FIXE","DEDUITE","DEDUITE","FIXE","FIXE","DEDUITE","FIXE","FIXE","FIXE","FIXE","DEDUITE","FIXE","DEDUITE","DEDUITE","FIXE","FIXE","DEDUITE","DEDUITE","FIXE","FIXE","DEDUITE","DEDUITE","DEDUITE","FIXE","FIXE","FIXE","DEDUITE","FIXE","FIXE","FIXE","DEDUITE","DEDUITE","DEDUITE","FIXE","DEDUITE","FIXE","FIXE","FIXE","FIXE","FIXE","FIXE","FIXE","FIXE","FIXE"]
["CRE concerné","CRE ACTIF","CRE concaténé ","Opération (CDOPEI)","Date de valeur (DTVAL)","Réseau (IDSCPT)","Commerçant","Montant Brut (MTBRUT)","Montant commission commerçant MTTTCITR","Interchange Fee (MTCOMINT)","Montant Scheme Fee ( Non présent dans le CRE - Toujours = 0)","Montant Com agent ","Nature carte","Type carte","Zone géographique","Code","CEENR","NUSQC","CEOPE","CEEMI","CEDES","CEAPC","CEMAP","DTTRT","CECFTO","CECFTD","CDNAFL","CDETB9","CDGUICH","NUISOA","DTVEN","ZSIRET","MTBRUT","CDDEV","NBDEC","TYPOPE","IDSPCT","NUARN","CDOPEI","DTREGLI","LILOCA","CDDEPT","CDPAYS","RAISOA","NURFI2","COANO","COCYIM","CEETRX","Ceguix","NUCTEA","CLRIBX","NUTP","Filler","NUMCO","CDICA","CDIBAN","CDDEVC","NBDECC","MTCOMP","REFEXT","NMCM","DTVL","NBFCT","NUREM","MTNT (net)","MTBREUR","DSPUSG","MDTRLT","DTCOMP","MTTTCITR\n(c.commerç)","MTCOMINT\n(comm int)","TYPO","CDETB9CL","NUISOACL","DTARCHCL","NUSDICL","IDREM","FILLER","NATCARTE","TYPCARTE","ZONEGEO","FILLER","TYPAPPLI","FILLER","REFPAYLINE","FILLER","MTCOAG","PAYMETHOD","FRAISACQ","NUMCO2LONG","NEW","FILLER"]
["Enregistrement 1","oui",{"$f":"IF(B8=\"OUI\",CONCATENATE(Q8,R8,S8,T8,U8,V8,W8,X8,Y8,Z8,AA8,AB8,AC8,AD8,AE8,AF8,AG8,AH8,AI8,AJ8,AK8,AL8,AM8,AN8,AO8,AP8,AQ8,AR8,AS8,AT8,AU8,AV8,AW8,AX8,AY8,AZ8,BA8,BB8,BC8,BD8,BE8,BF8,BG8,BH8,BI8,BJ8,BK8,BL8,BM8,BN8,BO8,BP8,BQ8,BR8,BS8,BT8,BU8,BV8,BW8,BX8,BY8,BZ8,CA8,CB8,CC8,CD8,CE8,CF8,CG8,CH8,CI8,CJ8,CK8,CL8,CM8,CN8),\"CRE NON ACTIF\")","v":"14000000Z01702817028XATRI    000021702892282513264KHYODHNJ313112025101960992700180001 00000000000125189782TI S224710856495           FAC000000001 RUE DES FLEURS    14250CM_01_COA/C         000000000000     17028922822829306014093001      9356031                                        978020000000000012493                     CM_01                   2010250000001561700000000000124430000000000012518     20251020000000000075000000000025 0000046432165461313564610000000000000000000120251019MONEXT                                            DPFRA       VAD                                                                                                                              000000000000                                                                   20228380131                                                                                                                                                                                                                                      "},"Payment","2025-10-20","CB","CM_01  ",125.18,0.75,0.25,0,0,"Débit","Particulier","FRA","CRE 1","14","000000","Z0","17028","17028","XA","TRI","    ","00","00","2","17028","92282","513264KHYODHNJ31311",{"$f":"TEXT(E8-1,\"aaaammjj\")","v":"20251019"},{"$f":"VLOOKUP(G8,'Listes déroulantes'!G:I,3,FALSE)","v":"60992700180001 "},{"$f":"RIGHT(CONCATENATE(\"0000000000000000\",H8*100),16)","v":"0000000000012518"},"978","2","TI ","S","224710856495           ","FAC","00000000",{"$f":"VLOOKUP(G8,'Listes déroulantes'!G:O,9,FALSE)","v":"1 RUE DES FLEURS    "},"14",250,{"$f":"VLOOKUP(G8,'Listes déroulantes'!G:H,2,FALSE)","v":"CM_01_COA/C         "},"000000000000","    "," ","17028","92282",{"$f":"VLOOKUP(G8,'Listes déroulantes'!G:N,8,FALSE)","v":"28293060140"},"93","001","      ",{"$f":"VLOOKUP(G8,'Listes déroulantes'!G:J,4,FALSE)","v":"9356031   "},"   ","                                  ","978","02",{"$f":"RIGHT(CONCATENATE(\"0000000000000000\",(H8-J8)*100),16)","v":"0000000000012493"},"                     ",{"$f":"VLOOKUP(G8,'Listes déroulantes'!G:M,7,FALSE)","v":"CM_01                   "},{"$f":"TEXT(E8,\"jjmmaa\")","v":"201025"},"000000","15617",{"$f":"RIGHT(CONCATENATE(\"0000000000000000\",(H8-I8)*100),16)","v":"0000000000012443"},{"$f":"RIGHT(CONCATENATE(\"0000000000000000\",H8*100),16)","v":"0000000000012518"}," ","    ",{"$f":"TEXT(E8,\"aaaammjj\")","v":"20251020"},{"$f":"RIGHT(CONCATENATE(\"0000000000000000\",(I8)*100),12)","v":"000000000075"},{"$f":"RIGHT(CONCATENATE(\"0000000000000000\",J8*100),12)","v":"000000000025"}," ","00000","4643216546131356461","00000000","000000",{"$f":"CONCATENATE(\"000001\",TEXT(E8-1,\"aaaammjj\"),\"MONEXT     \")","v":"00000120251019MONEXT     "},"                                       ",{"$f":"IF(M8=\"Débit\",\"D\",IF(M8=\"Crédit\",\"C\",IF(M8=\"Prépayé\",\"P\",IF(M8=\"Universelle\",\"U\",\" \"))))","v":"D"},{"$f":"IF(N8=\"Particulier\",\"P\",IF(N8=\"Entreprise\",\"E\",\" \"))","v":"P"},{"$f":"O8","v":"FRA"},"       ",{"$f":"VLOOKUP(G8,'Listes déroulantes'!G:L,6,FALSE)","v":"VAD  "},"                                                                                                    ","            ","            ",{"$f":"RIGHT(CONCATENATE(\"0000000000000000\",L8*100),12)","v":"000000000000"},"    ","             ","                                                  ","20228380131          ","                                                                                                                                                                                                                            "]
["Enregistrement 2","oui",{"$f":"IF(B9=\"OUI\",CONCATENATE(Q9,R9,S9,T9,U9,V9,W9,X9,Y9,Z9,AA9,AB9,AC9,AD9,AE9,AF9,AG9,AH9,AI9,AJ9,AK9,AL9,AM9,AN9,AO9,AP9,AQ9,AR9,AS9,AT9,AU9,AV9,AW9,AX9,AY9,AZ9,BA9,BB9,BC9,BD9,BE9,BF9,BG9,BH9,BI9,BJ9,BK9,BL9,BM9,BN9,BO9,BP9,BQ9,BR9,BS9,BT9,BU9,BV9,BW9,BX9,BY9,BZ9,CA9,CB9,CC9,CD9,CE9,CF9,CG9,CH9,CI9,CJ9,CK9,CL9,CM9,CN9),\"CRE NON ACTIF\")","v":"14000000Z01702817028XATRI    000021702892282513264KHYODHNJ313122025101960992700180001 00000000000250239782TI S224710856496           FAC000000001 RUE DES FLEURS    14250CM_01_COA/C         000000000000     17028922822829306014093001      9356031                                        978020000000000024973                     CM_01                   2010250000001561700000000000248730000000000025023     20251020000000000150000000000050 0000046432165461313564610000000000000000000120251019MONEXT                                            CPFRA       VAD                                                                                                                              000000000000                                                                   20228380132                                                                                                                                                                                                                                      "},"Payment","2025-10-20","CB","CM_01  ",250.23,1.5,0.5,0,0,"Crédit","Particulier","FRA","CRE 2","14","000000","Z0","17028","17028","XA","TRI","    ","00","00","2","17028","92282","513264KHYODHNJ31312",{"$f":"TEXT(E9-1,\"aaaammjj\")","v":"20251019"},{"$f":"VLOOKUP(G9,'Listes déroulantes'!G:I,3,FALSE)","v":"60992700180001 "},{"$f":"RIGHT(CONCATENATE(\"0000000000000000\",H9*100),16)","v":"0000000000025023"},"978","2","TI ","S","224710856496           ","FAC","00000000",{"$f":"VLOOKUP(G9,'Listes déroulantes'!G:O,9,FALSE)","v":"1 RUE DES FLEURS    "},"14",250,{"$f":"VLOOKUP(G9,'Listes déroulantes'!G:H,2,FALSE)","v":"CM_01_COA/C         "},"000000000000","    "," ","17028","92282",{"$f":"VLOOKUP(G9,'Listes déroulantes'!G:N,8,FALSE)","v":"28293060140"},"93","001","      ",{"$f":"VLOOKUP(G9,'Listes déroulantes'!G:J,4,FALSE)","v":"9356031   "},"   ","                                  ","978","02","0000000000024973","                     ",{"$f":"VLOOKUP(G9,'Listes déroulantes'!G:M,7,FALSE)","v":"CM_01                   "},{"$f":"TEXT(E9,\"jjmmaa\")","v":"201025"},"000000","15617",{"$f":"RIGHT(CONCATENATE(\"0000000000000000\",(H9-I9)*100),16)","v":"0000000000024873"},{"$f":"RIGHT(CONCATENATE(\"0000000000000000\",H9*100),16)","v":"0000000000025023"}," ","    ",{"$f":"TEXT(E9,\"aaaammjj\")","v":"20251020"},{"$f":"RIGHT(CONCATENATE(\"0000000000000000\",(I9)*100),12)","v":"000000000150"},{"$f":"RIGHT(CONCATENATE(\"0000000000000000\",J9*100),12)","v":"000000000050"}," ","00000","4643216546131356461","00000000","000000",{"$f":"CONCATENATE(\"000001\",TEXT(E9-1,\"aaaammjj\"),\"MONEXT     \")","v":"00000120251019MONEXT     "},"                                       ",{"$f":"IF(M9=\"Débit\",\"D\",IF(M9=\"Crédit\",\"C\",IF(M9=\"Prépayé\",\"P\",IF(M9=\"Universelle\",\"U\",\" \"))))","v":"C"},{"$f":"IF(N9=\"Particulier\",\"P\",IF(N9=\"Entreprise\",\"E\",\" \"))","v":"P"},{"$f":"O9","v":"FRA"},"       ",{"$f":"VLOOKUP(G9,'Listes déroulantes'!G:L,6,FALSE)","v":"VAD  "},"                                                                                                    ","            ","            ",{"$f":"RIGHT(CONCATENATE(\"0000000000000000\",L9*100),12)","v":"000000000000"},"    ","             ","                                                  ","20228380132          ","                                                                                                                                                                                                                            "]
["Enregistrement 3","oui","14000000Z01702817028XATRI    000021702892282513264KHYODHNJ313132025101960992700180002 00000000000045009782TI S224710856497           FAC000000002 RUE DES FLEURS    15250CM_02_COA/C         000000000000     17028922822829306014193001      9356032                                        978020000000000004491                     CM_02                   2010250000001561700000000000044730000000000004500     20251020000000000027000000000009 0000046432165461313564610000000000000000000120251019MONEXT                                            CPFRA       VAD                                                                                                                              000000000000                                                                   20228380133                                                                                                                                                                                                                                      ","Payment","2025-10-20","CB","CM_02",45,0.27,0.09,0,0,"Crédit","Particulier","FRA","CRE 3","14","000000","Z0","17028","17028","XA","TRI","    ","00","00","2","17028","92282","513264KHYODHNJ31313","20251019",{"$f":"VLOOKUP(G10,'Listes déroulantes'!G:I,3,FALSE)","v":"60992700180002 "},"0000000000004500","978","2","TI ","S","224710856497           ","FAC","00000000",{"$f":"VLOOKUP(G10,'Listes déroulantes'!G:O,9,FALSE)","v":"2 RUE DES FLEURS    "},"15",250,{"$f":"VLOOKUP(G10,'Listes déroulantes'!G:H,2,FALSE)","v":"CM_02_COA/C         "},"000000000000","    "," ","17028","92282",{"$f":"VLOOKUP(G10,'Listes déroulantes'!G:N,8,FALSE)","v":"28293060141"},"93","001","      ",{"$f":"VLOOKUP(G10,'Listes déroulantes'!G:J,4,FALSE)","v":"9356032   "},"   ","                                  ","978","02","0000000000004491","                     ",{"$f":"VLOOKUP(G10,'Listes déroulantes'!G:M,7,FALSE)","v":"CM_02                   "},"201025","000000","15617","0000000000004473","0000000000004500"," ","    ","20251020","000000000027","000000000009"," ","00000","4643216546131356461","00000000","000000","00000120251019MONEXT     ","                                       ","C","P","FRA","       ",{"$f":"VLOOKUP(G10,'Listes déroulantes'!G:L,6,FALSE)","v":"VAD  "},"                                                                                                    ","            ","            ","000000000000","    ","             ","                                                  ","20228380133          ","                                                                                                                                                                                                                            "]
["Enregistrement 4","oui","14000000Z01702817028XATRI    000021702892282513264KHYODHNJ313142025101960992700180003 00000000000220009782TI S224710856498           FAC000000003 RUE DES FLEURS    16250CM_03_COM/C         000000000000     17028922822829306014293001      9356033                                        978020000000000021956                     CM_03                   2010250000001561700000000000218680000000000022000     20251020000000000132000000000044 0000046432165461313564610000000000000000000120251019MONEXT                                            DEFRA       PDP                                                                                                                              000000000000                                                                   20228380134                                                                                                                                                                                                                                      ","Payment","2025-10-20","CB","CM_03",220,1.32,0.44,0,0,"Débit","Entreprise","FRA","CRE 4","14","000000","Z0","17028","17028","XA","TRI","    ","00","00","2","17028","92282","513264KHYODHNJ31314","20251019",{"$f":"VLOOKUP(G11,'Listes déroulantes'!G:I,3,FALSE)","v":"60992700180003 "},"0000000000022000","978","2","TI ","S","224710856498           ","FAC","00000000",{"$f":"VLOOKUP(G11,'Listes déroulantes'!G:O,9,FALSE)","v":"3 RUE DES FLEURS    "},"16",250,{"$f":"VLOOKUP(G11,'Listes déroulantes'!G:H,2,FALSE)","v":"CM_03_COM/C         "},"000000000000","    "," ","17028","92282",{"$f":"VLOOKUP(G11,'Listes déroulantes'!G:N,8,FALSE)","v":"28293060142"},"93","001","      ",{"$f":"VLOOKUP(G11,'Listes déroulantes'!G:J,4,FALSE)","v":"9356033   "},"   ","                                  ","978","02","0000000000021956","                     ",{"$f":"VLOOKUP(G11,'Listes déroulantes'!G:M,7,FALSE)","v":"CM_03                   "},"201025","000000","15617","0000000000021868","0000000000022000"," ","    ","20251020","000000000132","000000000044"," ","00000","4643216546131356461","00000000","000000","00000120251019MONEXT     ","                                       ","D","E","FRA","       ",{"$f":"VLOOKUP(G11,'Listes déroulantes'!G:L,6,FALSE)","v":"PDP  "},"                                                                                                    ","            ","            ","000000000000","    ","             ","                                                  ","20228380134          ","                                                                                                                                                                                                                            "]
["Enregistrement 5","oui","14000000Z01702817028XATRI    000021702892282513264KHYODHNJ313152025101960992700180004 00000000000100009782TI S224710856496           FAC000000004 RUE DES FLEURS    17250CM_04_COA/C         000000000000     17028922822829306014393001      9356034                                        978020000000000009980                     CM_04                   2010250000001561700000000000099400000000000010000     20251020000000000060000000000020 0000046432165461313564610000000000000000000120251019MONEXT                                            DPFRA       VAD                                                                                                                              000000000000                                                                   20228380135                                                                                                                                                                                                                                      ","Payment","2025-10-20","CB","CM_04",100,0.6,0.2,0,0,"Débit","Particulier","FRA","CRE 5","14","000000","Z0","17028","17028","XA","TRI","    ","00","00","2","17028","92282","513264KHYODHNJ31315","20251019",{"$f":"VLOOKUP(G12,'Listes déroulantes'!G:I,3,FALSE)","v":"60992700180004 "},"0000000000010000","978","2","TI ","S","224710856496           ","FAC","00000000",{"$f":"VLOOKUP(G12,'Listes déroulantes'!G:O,9,FALSE)","v":"4 RUE DES FLEURS    "},"17",250,{"$f":"VLOOKUP(G12,'Listes déroulantes'!G:H,2,FALSE)","v":"CM_04_COA/C         "},"000000000000","    "," ","17028","92282",{"$f":"VLOOKUP(G12,'Listes déroulantes'!G:N,8,FALSE)","v":"28293060143"},"93","001","      ",{"$f":"VLOOKUP(G12,'Listes déroulantes'!G:J,4,FALSE)","v":"9356034   "},"   ","                                  ","978","02","0000000000009980","                     ",{"$f":"VLOOKUP(G12,'Listes déroulantes'!G:M,7,FALSE)","v":"CM_04                   "},"201025","000000","15617","0000000000009940","0000000000010000"," ","    ","20251020","000000000060","000000000020"," ","00000","4643216546131356461","00000000","000000","00000120251019MONEXT     ","                                       ","D","P","FRA","       ",{"$f":"VLOOKUP(G12,'Listes déroulantes'!G:L,6,FALSE)","v":"VAD  "},"                                                                                                    ","            ","            ","000000000000","    ","             ","                                                  ","20228380135          ","                                                                                                                                                                                                                            "]
["Enregistrement 6","oui","14000000Z01702817028XATRI    000021702892282513264KHYODHNJ313162025101960992700180005 00000000000320009782TI S224710856497           FAC000000005 RUE DES FLEURS    18250CM_05_COA/M         000000000000     17028922822829306014493001      9356035                                        978020000000000031936                     CM_05                   2010250000001561700000000000318080000000000032000     20251020000000000192000000000064 0000046432165461313564610000000000000000000120251019MONEXT                                            CPFRA       VAD                                                                                                                              000000000000                                                                   20228380136                                                                                                                                                                                                                                      ","Payment","2025-10-20","CB","CM_05",320,1.92,0.64,0,0,"Crédit","Particulier","FRA","CRE 6","14","000000","Z0","17028","17028","XA","TRI","    ","00","00","2","17028","92282","513264KHYODHNJ31316","20251019",{"$f":"VLOOKUP(G13,'Listes déroulantes'!G:I,3,FALSE)","v":"60992700180005 "},"0000000000032000","978","2","TI ","S","224710856497           ","FAC","00000000",{"$f":"VLOOKUP(G13,'Listes déroulantes'!G:O,9,FALSE)","v":"5 RUE DES FLEURS    "},"18",250,{"$f":"VLOOKUP(G13,'Listes déroulantes'!G:H,2,FALSE)","v":"CM_05_COA/M         "},"000000000000","    "," ","17028","92282",{"$f":"VLOOKUP(G13,'Listes déroulantes'!G:N,8,FALSE)","v":"28293060144"},"93","001","      ",{"$f":"VLOOKUP(G13,'Listes déroulantes'!G:J,4,FALSE)","v":"9356035   "},"   ","                                  ","978","02","0000000000031936","                     ",{"$f":"VLOOKUP(G13,'Listes déroulantes'!G:M,7,FALSE)","v":"CM_05                   "},"201025","000000","15617","0000000000031808","0000000000032000"," ","    ","20251020","000000000192","000000000064"," ","00000","4643216546131356461","00000000","000000","00000120251019MONEXT     ","                                       ","C","P","FRA","       ",{"$f":"VLOOKUP(G13,'Listes déroulantes'!G:L,6,FALSE)","v":"VAD  "},"                                                                                                    ","            ","            ","000000000000","    ","             ","                                                  ","20228380136          ","                                                                                                                                                                                                                            "]
["Enregistrement 7","oui","14000000Z01702817028XATRI    000021702892282513264KHYODHNJ313172025101960992700180006 00000000000245239782TI S224710856495           FAC000000006 RUE DES FLEURS    19250CM_06 _COA/M        000000000000     17028922822829306014593001      9356036                                        978020000000000024474                     CM_06                   2010250000001561700000000000243760000000000024523     20251020000000000147000000000049 0000046432165461313564610000000000000000000120251019MONEXT                                            CPFRA       VAD                                                                                                                              000000000000                                                                   20228380137                                                                                                                                                                                                                                      ","Payment","2025-10-20","CB","CM_06",245.23,1.47,0.49,0,0,"Crédit","Particulier","FRA","CRE 7","14","000000","Z0","17028","17028","XA","TRI","    ","00","00","2","17028","92282","513264KHYODHNJ31317","20251019",{"$f":"VLOOKUP(G14,'Listes déroulantes'!G:I,3,FALSE)","v":"60992700180006 "},"0000000000024523","978","2","TI ","S","224710856495           ","FAC","00000000",{"$f":"VLOOKUP(G14,'Listes déroulantes'!G:O,9,FALSE)","v":"6 RUE DES FLEURS    "},"19",250,{"$f":"VLOOKUP(G14,'Listes déroulantes'!G:H,2,FALSE)","v":"CM_06 _COA/M        "},"000000000000","    "," ","17028","92282",{"$f":"VLOOKUP(G14,'Listes déroulantes'!G:N,8,FALSE)","v":"28293060145"},"93","001","      ",{"$f":"VLOOKUP(G14,'Listes déroulantes'!G:J,4,FALSE)","v":"9356036   "},"   ","                                  ","978","02","0000000000024474","                     ",{"$f":"VLOOKUP(G14,'Listes déroulantes'!G:M,7,FALSE)","v":"CM_06                   "},"201025","000000","15617","0000000000024376","0000000000024523"," ","    ","20251020","000000000147","000000000049"," ","00000","4643216546131356461","00000000","000000","00000120251019MONEXT     ","                                       ","C","P","FRA","       ",{"$f":"VLOOKUP(G14,'Listes déroulantes'!G:L,6,FALSE)","v":"VAD  "},"                                                                                                    ","            ","            ","000000000000","    ","             ","                                                  ","20228380137          ","                                                                                                                                                                                                                            "]
["Enregistrement 8","oui","14000000Z01702817028XATRI    000021702892282513264KHYODHNJ313182025101960992700180008 00000000000080239782TI S224710856496           FAC000000008 RUE DES FLEURS    20250CM_08_COA/C/CL1AG1  000000000000     17028922822829306013493001      9356038                                        978020000000000008007                     CM_08                   2010250000001561700000000000079750000000000008023     20251020000000000048000000000016 0000046432165461313564610000000000000000000120251019MONEXT                                            DEFRA       PDP                                                                                                                              000000000004                                                                   20228380138                                                                                                                                                                                                                                      ","Payment","2025-10-20","CB","CM_08",80.23,0.48,0.16,0,0.04,"Débit","Entreprise","FRA","CRE 8","14","000000","Z0","17028","17028","XA","TRI","    ","00","00","2","17028","92282","513264KHYODHNJ31318","20251019",{"$f":"VLOOKUP(G15,'Listes déroulantes'!G:I,3,FALSE)","v":"60992700180008 "},"0000000000008023","978","2","TI ","S","224710856496           ","FAC","00000000",{"$f":"VLOOKUP(G15,'Listes déroulantes'!G:O,9,FALSE)","v":"8 RUE DES FLEURS    "},"20",250,{"$f":"VLOOKUP(G15,'Listes déroulantes'!G:H,2,FALSE)","v":"CM_08_COA/C/CL1AG1  "},"000000000000","    "," ","17028","92282",{"$f":"VLOOKUP(G15,'Listes déroulantes'!G:N,8,FALSE)","v":"28293060134"},"93","001","      ",{"$f":"VLOOKUP(G15,'Listes déroulantes'!G:J,4,FALSE)","v":"9356038   "},"   ","                                  ","978","02","0000000000008007","                     ",{"$f":"VLOOKUP(G15,'Listes déroulantes'!G:M,7,FALSE)","v":"CM_08                   "},"201025","000000","15617","0000000000007975","0000000000008023"," ","    ","20251020","000000000048","000000000016"," ","00000","4643216546131356461","00000000","000000","00000120251019MONEXT     ","                                       ","D","E","FRA","       ",{"$f":"VLOOKUP(G15,'Listes déroulantes'!G:L,6,FALSE)","v":"PDP  "},"                                                                                                    ","            ","            ","000000000004","    ","             ","                                                  ","20228380138          ","                                                                                                                                                                                                                            "]
["Enregistrement 9","oui","14000000Z01702817028XATRI    000021702892282513264KHYODHNJ313192025101960992700180009 00000000000102009782TI S224710856495           FAC000000009 RUE DES FLEURS    21250CM_09_COA/C/CL2AG1  000000000000     17028922822829306013493001      9356039                                        978020000000000010180                     CM_09                   2010250000001561700000000000101390000000000010200     20251020000000000061000000000020 0000046432165461313564610000000000000000000120251019MONEXT                                            DPFRA       PDP                                                                                                                              000000000005                                                                   20228380139                                                                                                                                                                                                                                      ","Payment","2025-10-20","CB","CM_09",102,0.61,0.2,0,0.05,"Débit","Particulier","FRA","CRE 9","14","000000","Z0","17028","17028","XA","TRI","    ","00","00","2","17028","92282","513264KHYODHNJ31319","20251019",{"$f":"VLOOKUP(G16,'Listes déroulantes'!G:I,3,FALSE)","v":"60992700180009 "},"0000000000010200","978","2","TI ","S","224710856495           ","FAC","00000000",{"$f":"VLOOKUP(G16,'Listes déroulantes'!G:O,9,FALSE)","v":"9 RUE DES FLEURS    "},"21",250,{"$f":"VLOOKUP(G16,'Listes déroulantes'!G:H,2,FALSE)","v":"CM_09_COA/C/CL2AG1  "},"000000000000","    "," ","17028","92282",{"$f":"VLOOKUP(G16,'Listes déroulantes'!G:N,8,FALSE)","v":"28293060134"},"93","001","      ",{"$f":"VLOOKUP(G16,'Listes déroulantes'!G:J,4,FALSE)","v":"9356039   "},"   ","                                  ","978","02","0000000000010180","                     ",{"$f":"VLOOKUP(G16,'Listes déroulantes'!G:M,7,FALSE)","v":"CM_09                   "},"201025","000000","15617","0000000000010139","0000000000010200"," ","    ","20251020","000000000061","000000000020"," ","00000","4643216546131356461","00000000","000000","00000120251019MONEXT     ","                                       ","D","P","FRA","       ",{"$f":"VLOOKUP(G16,'Listes déroulantes'!G:L,6,FALSE)","v":"PDP  "},"                                                                                                    ","            ","            ","000000000005","    ","             ","                                                  ","20228380139          ","                                                                                                                                                                                                                            "]
["Enregistrement 10","oui","14000000Z01702817028XATRI    000021702892282513264KHYODHNJ313202025101960992700180010 00000000000078009782TI S224710856496           FAC0000000010 RUE DES FLEURS   22250CM_10_COM/C         000000000000     17028922822829306013593001      9356040                                        978020000000000007784                     CM_10                   2010250000001561700000000000077530000000000007800     20251020000000000047000000000016 0000046432165461313564610000000000000000000120251019MONEXT                                            DPFRA       VAD                                                                                                                              000000000000                                                                   20228380140                                                                                                                                                                                                                                      ","Payment","2025-10-20","CB","CM_10",78,0.47,0.16,0,0,"Débit","Particulier","FRA","CRE 10","14","000000","Z0","17028","17028","XA","TRI","    ","00","00","2","17028","92282","513264KHYODHNJ31320","20251019",{"$f":"VLOOKUP(G17,'Listes déroulantes'!G:I,3,FALSE)","v":"60992700180010 "},"0000000000007800","978","2","TI ","S","224710856496           ","FAC","00000000",{"$f":"VLOOKUP(G17,'Listes déroulantes'!G:O,9,FALSE)","v":"10 RUE DES FLEURS   "},"22",250,{"$f":"VLOOKUP(G17,'Listes déroulantes'!G:H,2,FALSE)","v":"CM_10_COM/C         "},"000000000000","    "," ","17028","92282",{"$f":"VLOOKUP(G17,'Listes déroulantes'!G:N,8,FALSE)","v":"28293060135"},"93","001","      ",{"$f":"VLOOKUP(G17,'Listes déroulantes'!G:J,4,FALSE)","v":"9356040   "},"   ","                                  ","978","02","0000000000007784","                     ",{"$f":"VLOOKUP(G17,'Listes déroulantes'!G:M,7,FALSE)","v":"CM_10                   "},"201025","000000","15617","0000000000007753","0000000000007800"," ","    ","20251020","000000000047","000000000016"," ","00000","4643216546131356461","00000000","000000","00000120251019MONEXT     ","                                       ","D","P","FRA","       ",{"$f":"VLOOKUP(G17,'Listes déroulantes'!G:L,6,FALSE)","v":"VAD  "},"                                                                                                    ","            ","            ","000000000000","    ","             ","                                                  ","20228380140          ","                                                                                                                                                                                                                            "]
["Enregistrement 11","non","CRE NON ACTIF","Payment","2022-12-19","CB","CM_32_VAD",220,1.32,0.44,0,0,"Débit","Particulier","FRA","CRE 11","14","000000","Z0","17028","17028","XA","TRI","    ","00","00","2","17028","92282","513264KHYODHNJ31321","20221218",{"$f":"VLOOKUP(G18,'Listes déroulantes'!G:I,3,FALSE)","v":"60903200190001 "},"0000000000022000","978","2","TI ","S","224710856495           ","FAC","00000000",{"$f":"VLOOKUP(G18,'Listes déroulantes'!G:O,9,FALSE)","v":"32 RUE DU TEST      "},"23",250,{"$f":"VLOOKUP(G18,'Listes déroulantes'!G:H,2,FALSE)","v":"CM_32               "},"000000000000","    "," ","17028","92282",{"$f":"VLOOKUP(G18,'Listes déroulantes'!G:N,8,FALSE)","v":"28293060232"},"93","001","      ",{"$f":"VLOOKUP(G18,'Listes déroulantes'!G:J,4,FALSE)","v":"9556032   "},"   ","                                  ","978","02","0000000000021956","                     ",{"$f":"VLOOKUP(G18,'Listes déroulantes'!G:M,7,FALSE)","v":"CM_32                   "},"191222","000000","15617","0000000000021868","0000000000022000"," ","    ","20221219","000000000132","000000000044"," ","00000","4643216546131356461","00000000","000000","00000120221218MONEXT     ","                                       ","D","P","FRA","       ",{"$f":"VLOOKUP(G18,'Listes déroulantes'!G:L,6,FALSE)","v":"VAD  "},"                                                                                                    ","            ","            ","000000000000","    ","             ","                                                  ","20228380141          ","                                                                                                                                                                                                                            "]
["Enregistrement 12","non","CRE NON ACTIF","Payment","2022-12-19","CB","CM_32_VAD",80.23,0.48,0.16,0,0,"Débit","Particulier","FRA","CRE 12","14","000000","Z0","17028","17028","XA","TRI","    ","00","00","2","17028","92282","513264KHYODHNJ31322","20221218",{"$f":"VLOOKUP(G19,'Listes déroulantes'!G:I,3,FALSE)","v":"60903200190001 "},"0000000000008023","978","2","TI ","S","224710856496           ","FAC","00000000",{"$f":"VLOOKUP(G19,'Listes déroulantes'!G:O,9,FALSE)","v":"32 RUE DU TEST      "},"24",250,{"$f":"VLOOKUP(G19,'Listes déroulantes'!G:H,2,FALSE)","v":"CM_32               "},"000000000000","    "," ","17028","92282",{"$f":"VLOOKUP(G19,'Listes déroulantes'!G:N,8,FALSE)","v":"28293060232"},"93","001","      ",{"$f":"VLOOKUP(G19,'Listes déroulantes'!G:J,4,FALSE)","v":"9556032   "},"   ","                                  ","978","02","0000000000008007","                     ",{"$f":"VLOOKUP(G19,'Listes déroulantes'!G:M,7,FALSE)","v":"CM_32                   "},"191222","000000","15617","0000000000007975","0000000000008023"," ","    ","20221219","000000000048","000000000016"," ","00000","4643216546131356461","00000000","000000","00000120221218MONEXT     ","                                       ","D","P","FRA","       ",{"$f":"VLOOKUP(G19,'Listes déroulantes'!G:L,6,FALSE)","v":"VAD  "},"                                                                                                    ","            ","            ","000000000000","    ","             ","                                                  ","20228380142          ","                                                                                                                                                                                                                            "]
["Enregistrement 13","non","CRE NON ACTIF","Payment","2022-12-19","CB","CM_34_AG1",102,0.61,0.2,0,0,"Débit","Particulier","FRA","CRE 13","14","000000","Z0","17028","17028","XA","TRI","    ","00","00","2","17028","92282","513264KHYODHNJ31323","20221218",{"$f":"VLOOKUP(G20,'Listes déroulantes'!G:I,3,FALSE)","v":"60903400190001 "},"0000000000010200","978","2","TI ","S","224710856495           ","FAC","00000000",{"$f":"VLOOKUP(G20,'Listes déroulantes'!G:O,9,FALSE)","v":"34 RUE DU TEST      "},"25",250,{"$f":"VLOOKUP(G20,'Listes déroulantes'!G:H,2,FALSE)","v":"CM_34_AG1           "},"000000000000","    "," ","17028","92282",{"$f":"VLOOKUP(G20,'Listes déroulantes'!G:N,8,FALSE)","v":"28293060234"},"93","001","      ",{"$f":"VLOOKUP(G20,'Listes déroulantes'!G:J,4,FALSE)","v":"9556034   "},"   ","                                  ","978","02","0000000000010180","                     ",{"$f":"VLOOKUP(G20,'Listes déroulantes'!G:M,7,FALSE)","v":"CM_34                   "},"191222","000000","15617","0000000000010139","0000000000010200"," ","    ","20221219","000000000061","000000000020"," ","00000","4643216546131356461","00000000","000000","00000120221218MONEXT     ","                                       ","D","P","FRA","       ",{"$f":"VLOOKUP(G20,'Listes déroulantes'!G:L,6,FALSE)","v":"VAD  "},"                                                                                                    ","            ","            ","000000000000","    ","             ","                                                  ","20228380143          ","                                                                                                                                                                                                                            "]
["Enregistrement 14","non","CRE NON ACTIF","Payment","2022-12-19","CB","CM_34_AG1",78,0.47,0.16,0,0,"Débit","Particulier","FRA","CRE 14","14","000000","Z0","17028","17028","XA","TRI","    ","00","00","2","17028","92282","513264KHYODHNJ31324","20221218",{"$f":"VLOOKUP(G21,'Listes déroulantes'!G:I,3,FALSE)","v":"60903400190001 "},"0000000000007800","978","2","TI ","S","224710856496           ","FAC","00000000",{"$f":"VLOOKUP(G21,'Listes déroulantes'!G:O,9,FALSE)","v":"34 RUE DU TEST      "},"26",250,{"$f":"VLOOKUP(G21,'Listes déroulantes'!G:H,2,FALSE)","v":"CM_34_AG1           "},"000000000000","    "," ","17028","92282",{"$f":"VLOOKUP(G21,'Listes déroulantes'!G:N,8,FALSE)","v":"28293060234"},"93","001","      ",{"$f":"VLOOKUP(G21,'Listes déroulantes'!G:J,4,FALSE)","v":"9556034   "},"   ","                                  ","978","02","0000000000007784","                     ",{"$f":"VLOOKUP(G21,'Listes déroulantes'!G:M,7,FALSE)","v":"CM_34                   "},"191222","000000","15617","0000000000007753","0000000000007800"," ","    ","20221219","000000000047","000000000016"," ","00000","4643216546131356461","00000000","000000","00000120221218MONEXT     ","                                       ","D","P","FRA","       ",{"$f":"VLOOKUP(G21,'Listes déroulantes'!G:L,6,FALSE)","v":"VAD  "},"                                                                                                    ","            ","            ","000000000000","    ","             ","                                                  ","20228380144          ","                                                                                                                                                                                                                            "]
["Enregistrement 15","non","CRE NON ACTIF","Payment","2022-12-19","CB","CM_34_AG1",0,0,0,0,0,"Débit","Particulier","FRA","CRE 15","14","000000","Z0","17028","17028","XA","TRI","    ","00","00","2","17028","92282","513264KHYODHNJ31325","20221218",{"$f":"VLOOKUP(G22,'Listes déroulantes'!G:I,3,FALSE)","v":"60903400190001 "},"0000000000000000","978","2","TI ","S","224710856495           ","FAC","00000000",{"$f":"VLOOKUP(G22,'Listes déroulantes'!G:O,9,FALSE)","v":"34 RUE DU TEST      "},"27",250,{"$f":"VLOOKUP(G22,'Listes déroulantes'!G:H,2,FALSE)","v":"CM_34_AG1           "},"000000000000","    "," ","17028","92282",{"$f":"VLOOKUP(G22,'Listes déroulantes'!G:N,8,FALSE)","v":"28293060234"},"93","001","      ",{"$f":"VLOOKUP(G22,'Listes déroulantes'!G:J,4,FALSE)","v":"9556034   "},"   ","                                  ","978","02","0000000000000000","                     ",{"$f":"VLOOKUP(G22,'Listes déroulantes'!G:M,7,FALSE)","v":"CM_34                   "},"191222","000000","15617","0000000000000000","0000000000000000"," ","    ","20221219","000000000000","000000000000"," ","00000","4643216546131356461","00000000","000000","00000120221218MONEXT     ","                                       ","D","P","FRA","       ",{"$f":"VLOOKUP(G22,'Listes déroulantes'!G:L,6,FALSE)","v":"VAD  "},"                                                                                                    ","            ","            ","000000000000","    ","             ","                                                  ","20228380145          ","                                                                                                                                                                                                                            "]
["Enregistrement 16","non","CRE NON ACTIF","Payment","2022-12-19","CB","CM_34_AG1",100,2.5,0.5,0,0,"Débit","Particulier","FRA","CRE 16","14","000000","Z0","17028","17028","XA","TRI","    ","00","00","2","17028","92282","513264KHYODHNJ31326","20221218",{"$f":"VLOOKUP(G23,'Listes déroulantes'!G:I,3,FALSE)","v":"60903400190001 "},"0000000000010000","978","2","TI ","S","224710856496           ","FAC","00000000",{"$f":"VLOOKUP(G23,'Listes déroulantes'!G:O,9,FALSE)","v":"34 RUE DU TEST      "},"28",250,{"$f":"VLOOKUP(G23,'Listes déroulantes'!G:H,2,FALSE)","v":"CM_34_AG1           "},"000000000000","    "," ","17028","92282",{"$f":"VLOOKUP(G23,'Listes déroulantes'!G:N,8,FALSE)","v":"28293060234"},"93","001","      ",{"$f":"VLOOKUP(G23,'Listes déroulantes'!G:J,4,FALSE)","v":"9556034   "},"   ","                                  ","978","02","0000000000009950","                     ",{"$f":"VLOOKUP(G23,'Listes déroulantes'!G:M,7,FALSE)","v":"CM_34                   "},"191222","000000","15617","0000000000009750","0000000000010000"," ","    ","20221219","000000000250","000000000050"," ","00000","4643216546131356461","00000000","000000","00000120221218MONEXT     ","                                       ","D","P","FRA","       ",{"$f":"VLOOKUP(G23,'Listes déroulantes'!G:L,6,FALSE)","v":"VAD  "},"                                                                                                    ","            ","            ","000000000000","    ","             ","                                                  ","20228380146          ","                                                                                                                                                                                                                            "]
["Enregistrement 17","non","CRE NON ACTIF","Payment","2022-12-19","CB","SAS MONEXT PDP",246,2.5,1,0,0,"Débit","Particulier","FRA","CRE 17","14","000000","Z0","17028","17028","XA","TRI","    ","00","00","2","17028","92282","513264KHYODHNJ31327","20221218",{"$f":"VLOOKUP(G24,'Listes déroulantes'!G:I,3,FALSE)","v":"50318500100032 "},"0000000000024600","978","2","TI ","S","224710856495           ","FAC","00000000",{"$f":"VLOOKUP(G24,'Listes déroulantes'!G:O,9,FALSE)","v":"260 RUE CLAUDE NICOL"},"29",250,{"$f":"VLOOKUP(G24,'Listes déroulantes'!G:H,2,FALSE)","v":"SAS MONEXT          "},"000000000000","    "," ","17028","92282",{"$f":"VLOOKUP(G24,'Listes déroulantes'!G:N,8,FALSE)","v":"20289045644"},"93","001","      ",{"$f":"VLOOKUP(G24,'Listes déroulantes'!G:J,4,FALSE)","v":"9255001   "},"   ","                                  ","978","02","0000000000024500","                     ",{"$f":"VLOOKUP(G24,'Listes déroulantes'!G:M,7,FALSE)","v":"MONEXT                  "},"191222","000000","15617","0000000000024350","0000000000024600"," ","    ","20221219","000000000250","000000000100"," ","00000","4643216546131356461","00000000","000000","00000120221218MONEXT     ","                                       ","D","P","FRA","       ",{"$f":"VLOOKUP(G24,'Listes déroulantes'!G:L,6,FALSE)","v":"PDP  "},"                                                                                                    ","            ","            ","000000000000","    ","             ","                                                  ","20228380147          ","                                                                                                                                                                                                                            "]
["Enregistrement 18","non","CRE NON ACTIF","Payment","2022-12-19","CB","CM_7_RMFEC VAD",100,2.5,0.5,0,0,"Débit","Particulier","FRA","CRE 18","14","000000","Z0","17028","17028","XA","TRI","    ","00","00","2","17028","92282","513264KHYODHNJ31328","20221218",{"$f":"VLOOKUP(G25,'Listes déroulantes'!G:I,3,FALSE)","v":"60920700180001 "},"0000000000010000","978","2","TI ","S","224710856496           ","FAC","00000000",{"$f":"VLOOKUP(G25,'Listes déroulantes'!G:O,9,FALSE)","v":"20 RUE CARDINALE    "},"30",250,{"$f":"VLOOKUP(G25,'Listes déroulantes'!G:H,2,FALSE)","v":"CM_7_RMFEC          "},"000000000000","    "," ","17028","92282",{"$f":"VLOOKUP(G25,'Listes déroulantes'!G:N,8,FALSE)","v":"28293060129"},"93","001","      ",{"$f":"VLOOKUP(G25,'Listes déroulantes'!G:J,4,FALSE)","v":"9256012   "},"   ","                                  ","978","02","0000000000009950","                     ",{"$f":"VLOOKUP(G25,'Listes déroulantes'!G:M,7,FALSE)","v":"CM_7_RMFEC VAD          "},"191222","000000","15617","0000000000009750","0000000000010000"," ","    ","20221219","000000000250","000000000050"," ","00000","4643216546131356461","00000000","000000","00000120221218MONEXT     ","                                       ","D","P","FRA","       ",{"$f":"VLOOKUP(G25,'Listes déroulantes'!G:L,6,FALSE)","v":"VAD  "},"                                                                                                    ","            ","            ","000000000000","    ","             ","                                                  ","20228380148          ","                                                                                                                                                                                                                            "]
["Enregistrement 19","non","CRE NON ACTIF","Payment","2022-12-19","CB","CM_6_RMFEC VAD",45.22,2.5,0.5,0,0,"Débit","Particulier","FRA","CRE 19","14","000000","Z0","17028","17028","XA","TRI","    ","00","00","2","17028","92282","513264KHYODHNJ31329","20221218",{"$f":"VLOOKUP(G26,'Listes déroulantes'!G:I,3,FALSE)","v":"60919700180001 "},"0000000000004522","978","2","TI ","S","224710856495           ","FAC","00000000",{"$f":"VLOOKUP(G26,'Listes déroulantes'!G:O,9,FALSE)","v":"20 RUE JEAN JAURES  "},"31",250,{"$f":"VLOOKUP(G26,'Listes déroulantes'!G:H,2,FALSE)","v":"CM_6_RMFEC          "},"000000000000","    "," ","17028","92282",{"$f":"VLOOKUP(G26,'Listes déroulantes'!G:N,8,FALSE)","v":"28293060128"},"93","001","      ",{"$f":"VLOOKUP(G26,'Listes déroulantes'!G:J,4,FALSE)","v":"9256010   "},"   ","                                  ","978","02","0000000000004472","                     ",{"$f":"VLOOKUP(G26,'Listes déroulantes'!G:M,7,FALSE)","v":"CM_6_RMFEC VAD          "},"191222","000000","15617","0000000000004272","0000000000004522"," ","    ","20221219","000000000250","000000000050"," ","00000","4643216546131356461","00000000","000000","00000120221218MONEXT     ","                                       ","D","P","FRA","       ",{"$f":"VLOOKUP(G26,'Listes déroulantes'!G:L,6,FALSE)","v":"VAD  "},"                                                                                                    ","            ","            ","000000000000","    ","             ","                                                  ","20228380149          ","                                                                                                                                                                                                                            "]
["Enregistrement 20","non","CRE NON ACTIF","Payment","2022-12-19","CB","CM_5_RMFEC VAD",100,2.5,0.5,0,0,"Débit","Particulier","FRA","CRE 20","14","000000","Z0","17028","17028","XA","TRI","    ","00","00","2","17028","92282","513264KHYODHNJ31330","20221218",{"$f":"VLOOKUP(G27,'Listes déroulantes'!G:I,3,FALSE)","v":"60819700180001 "},"0000000000010000","978","2","TI ","S","224710856496           ","FAC","00000000",{"$f":"VLOOKUP(G27,'Listes déroulantes'!G:O,9,FALSE)","v":"43 RUE CLEMENCE     "},"32",250,{"$f":"VLOOKUP(G27,'Listes déroulantes'!G:H,2,FALSE)","v":"CM_5_RMFEC          "},"000000000000","    "," ","17028","92282",{"$f":"VLOOKUP(G27,'Listes déroulantes'!G:N,8,FALSE)","v":"28293060127"},"93","001","      ",{"$f":"VLOOKUP(G27,'Listes déroulantes'!G:J,4,FALSE)","v":"9256009   "},"   ","                                  ","978","02","0000000000009950","                     ",{"$f":"VLOOKUP(G27,'Listes déroulantes'!G:M,7,FALSE)","v":"CM_5_RMFEC VAD          "},"191222","000000","15617","0000000000009750","0000000000010000"," ","    ","20221219","000000000250","000000000050"," ","00000","4643216546131356461","00000000","000000","00000120221218MONEXT     ","                                       ","D","P","FRA","       ",{"$f":"VLOOKUP(G27,'Listes déroulantes'!G:L,6,FALSE)","v":"VAD  "},"                                                                                                    ","            ","            ","000000000000","    ","             ","                                                  ","20228380150          ","                                                                                                                                                                                                                            "]
["Enregistrement 21","non","CRE NON ACTIF","Payment","2022-12-19","CB","SAS MONEXT PDP",250,2.5,1,0,0,"Débit","Particulier","FRA","CRE 21","14","000000","Z0","17028","17028","XA","TRI","    ","00","00","2","17028","92282","513264KHYODHNJ31331","20221218",{"$f":"VLOOKUP(G28,'Listes déroulantes'!G:I,3,FALSE)","v":"50318500100032 "},"0000000000025000","978","2","TI ","S","224710856495           ","FAC","00000000",{"$f":"VLOOKUP(G28,'Listes déroulantes'!G:O,9,FALSE)","v":"260 RUE CLAUDE NICOL"},"33",250,{"$f":"VLOOKUP(G28,'Listes déroulantes'!G:H,2,FALSE)","v":"SAS MONEXT          "},"000000000000","    "," ","17028","92282",{"$f":"VLOOKUP(G28,'Listes déroulantes'!G:N,8,FALSE)","v":"20289045644"},"93","001","      ",{"$f":"VLOOKUP(G28,'Listes déroulantes'!G:J,4,FALSE)","v":"9255001   "},"   ","                                  ","978","02","0000000000024900","                     ",{"$f":"VLOOKUP(G28,'Listes déroulantes'!G:M,7,FALSE)","v":"MONEXT                  "},"191222","000000","15617","0000000000024750","0000000000025000"," ","    ","20221219","000000000250","000000000100"," ","00000","4643216546131356461","00000000","000000","00000120221218MONEXT     ","                                       ","D","P","FRA","       ",{"$f":"VLOOKUP(G28,'Listes déroulantes'!G:L,6,FALSE)","v":"PDP  "},"                                                                                                    ","            ","            ","000000000000","    ","             ","                                                  ","20228380151          ","                                                                                                                                                                                                                            "]
["Enregistrement 22","oui","14000000Z01702817028XATRI    000021702892282513264KHYODHNJ313322025101960992700180001 00000000000066009782TI S224710856496           AVO000000001 RUE DES FLEURS    34250CM_01_COA/C         000000000000     17028922822829306014093001      9356031                                        978020000000000006587                     CM_01                   2010250000001561700000000000066000000000000006600     20251020000000000000000000000013 0000046432165461313564610000000000000000000220251019MONEXT                                            DPFRA       VAD                                                                                                                              000000000000                                                                   20228380152                                                                                                                                                                                                                                      ","Refund","2025-10-20","CB","CM_01  ",66,0,0.13,0,0,"Débit","Particulier","FRA","CRE 22","14","000000","Z0","17028","17028","XA","TRI","    ","00","00","2","17028","92282","513264KHYODHNJ31332","20251019",{"$f":"VLOOKUP(G29,'Listes déroulantes'!G:I,3,FALSE)","v":"60992700180001 "},"0000000000006600","978","2","TI ","S","224710856496           ","AVO","00000000",{"$f":"VLOOKUP(G29,'Listes déroulantes'!G:O,9,FALSE)","v":"1 RUE DES FLEURS    "},"34",250,{"$f":"VLOOKUP(G29,'Listes déroulantes'!G:H,2,FALSE)","v":"CM_01_COA/C         "},"000000000000","    "," ","17028","92282",{"$f":"VLOOKUP(G29,'Listes déroulantes'!G:N,8,FALSE)","v":"28293060140"},"93","001","      ",{"$f":"VLOOKUP(G29,'Listes déroulantes'!G:J,4,FALSE)","v":"9356031   "},"   ","                                  ","978","02","0000000000006587","                     ",{"$f":"VLOOKUP(G29,'Listes déroulantes'!G:M,7,FALSE)","v":"CM_01                   "},"201025","000000","15617","0000000000006600","0000000000006600"," ","    ","20251020","000000000000","000000000013"," ","00000","4643216546131356461","00000000","000000",{"$f":"CONCATENATE(\"000002\",TEXT(E29-1,\"aaaammjj\"),\"MONEXT     \")","v":"00000220251019MONEXT     "},"                                       ","D","P","FRA","       ",{"$f":"VLOOKUP(G29,'Listes déroulantes'!G:L,6,FALSE)","v":"VAD  "},"                                                                                                    ","            ","            ","000000000000","    ","             ","                                                  ","20228380152          ","                                                                                                                                                                                                                            "]
["Enregistrement 23","oui","14000000Z01702817028XATRI    000021702892282513264KHYODHNJ313332025101960992700180004 00000000000060009782TI S224710856495           AVO000000004 RUE DES FLEURS    35250CM_04_COA/C         000000000000     17028922822829306014393001      9356034                                        978020000000000005988                     CM_04                   2010250000001561700000000000059640000000000006000     20251020000000000036000000000012 0000046432165461313564610000000000000000000220251019MONEXT                                            DPFRA       VAD                                                                                                                              000000000000                                                                   20228380153                                                                                                                                                                                                                                      ","Refund","2025-10-20","CB","CM_04",60,0.36,0.12,0,0,"Débit","Particulier","FRA","CRE 23","14","000000","Z0","17028","17028","XA","TRI","    ","00","00","2","17028","92282","513264KHYODHNJ31333","20251019",{"$f":"VLOOKUP(G30,'Listes déroulantes'!G:I,3,FALSE)","v":"60992700180004 "},"0000000000006000","978","2","TI ","S","224710856495           ","AVO","00000000",{"$f":"VLOOKUP(G30,'Listes déroulantes'!G:O,9,FALSE)","v":"4 RUE DES FLEURS    "},"35",250,{"$f":"VLOOKUP(G30,'Listes déroulantes'!G:H,2,FALSE)","v":"CM_04_COA/C         "},"000000000000","    "," ","17028","92282",{"$f":"VLOOKUP(G30,'Listes déroulantes'!G:N,8,FALSE)","v":"28293060143"},"93","001","      ",{"$f":"VLOOKUP(G30,'Listes déroulantes'!G:J,4,FALSE)","v":"9356034   "},"   ","                                  ","978","02","0000000000005988","                     ",{"$f":"VLOOKUP(G30,'Listes déroulantes'!G:M,7,FALSE)","v":"CM_04                   "},"201025","000000","15617","0000000000005964","0000000000006000"," ","    ","20251020","000000000036","000000000012"," ","00000","4643216546131356461","00000000","000000",{"$f":"CONCATENATE(\"000002\",TEXT(E30-1,\"aaaammjj\"),\"MONEXT     \")","v":"00000220251019MONEXT     "},"                                       ","D","P","FRA","       ",{"$f":"VLOOKUP(G30,'Listes déroulantes'!G:L,6,FALSE)","v":"VAD  "},"                                                                                                    ","            ","            ","000000000000","    ","             ","                                                  ","20228380153          ","                                                                                                                                                                                                                            "]
["Enregistrement 24","oui","14000000Z01702817028XATRI    000021702892282513264KHYODHNJ313342025101960992700180004 00000000000080009782TI S224710856496           AVO000000004 RUE DES FLEURS    36250CM_04_COA/C         000000000000     17028922822829306014393001      9356034                                        978020000000000007984                     CM_04                   2010250000001561700000000000079520000000000008000     20251020000000000048000000000016 0000046432165461313564610000000000000000000220251019MONEXT                                            DPFRA       VAD                                                                                                                              000000000000                                                                   20228380154                                                                                                                                                                                                                                      ","Refund","2025-10-20","CB","CM_04",80,0.48,0.16,0,0,"Débit","Particulier","FRA","CRE 24","14","000000","Z0","17028","17028","XA","TRI","    ","00","00","2","17028","92282","513264KHYODHNJ31334","20251019",{"$f":"VLOOKUP(G31,'Listes déroulantes'!G:I,3,FALSE)","v":"60992700180004 "},"0000000000008000","978","2","TI ","S","224710856496           ","AVO","00000000",{"$f":"VLOOKUP(G31,'Listes déroulantes'!G:O,9,FALSE)","v":"4 RUE DES FLEURS    "},"36",250,{"$f":"VLOOKUP(G31,'Listes déroulantes'!G:H,2,FALSE)","v":"CM_04_COA/C         "},"000000000000","    "," ","17028","92282",{"$f":"VLOOKUP(G31,'Listes déroulantes'!G:N,8,FALSE)","v":"28293060143"},"93","001","      ",{"$f":"VLOOKUP(G31,'Listes déroulantes'!G:J,4,FALSE)","v":"9356034   "},"   ","                                  ","978","02","0000000000007984","                     ",{"$f":"VLOOKUP(G31,'Listes déroulantes'!G:M,7,FALSE)","v":"CM_04                   "},"201025","000000","15617","0000000000007952","0000000000008000"," ","    ","20251020","000000000048","000000000016"," ","00000","4643216546131356461","00000000","000000","00000220251019MONEXT     ","                                       ","D","P","FRA","       ",{"$f":"VLOOKUP(G31,'Listes déroulantes'!G:L,6,FALSE)","v":"VAD  "},"                                                                                                    ","            ","            ","000000000000","    ","             ","                                                  ","20228380154          ","                                                                                                                                                                                                                            "]
["Enregistrement 25","oui","14000000Z01702817028XATRI    000021702892282513264KHYODHNJ313352025101960992700180005 00000000000067009782TI S224710856495           AVO000000005 RUE DES FLEURS    37250CM_05_COA/M         000000000000     17028922822829306014493001      9356035                                        978020000000000006687                     CM_05                   2010250000001561700000000000066600000000000006700     20251020000000000040000000000013 0000046432165461313564610000000000000000000220251019MONEXT                                            DPFRA       VAD                                                                                                                              000000000000                                                                   20228380155                                                                                                                                                                                                                                      ","Refund","2025-10-20","CB","CM_05",67,0.4,0.13,0,0,"Débit","Particulier","FRA","CRE 25","14","000000","Z0","17028","17028","XA","TRI","    ","00","00","2","17028","92282","513264KHYODHNJ31335","20251019",{"$f":"VLOOKUP(G32,'Listes déroulantes'!G:I,3,FALSE)","v":"60992700180005 "},"0000000000006700","978","2","TI ","S","224710856495           ","AVO","00000000",{"$f":"VLOOKUP(G32,'Listes déroulantes'!G:O,9,FALSE)","v":"5 RUE DES FLEURS    "},"37",250,{"$f":"VLOOKUP(G32,'Listes déroulantes'!G:H,2,FALSE)","v":"CM_05_COA/M         "},"000000000000","    "," ","17028","92282",{"$f":"VLOOKUP(G32,'Listes déroulantes'!G:N,8,FALSE)","v":"28293060144"},"93","001","      ",{"$f":"VLOOKUP(G32,'Listes déroulantes'!G:J,4,FALSE)","v":"9356035   "},"   ","                                  ","978","02","0000000000006687","                     ",{"$f":"VLOOKUP(G32,'Listes déroulantes'!G:M,7,FALSE)","v":"CM_05                   "},"201025","000000","15617","0000000000006660","0000000000006700"," ","    ","20251020","000000000040","000000000013"," ","00000","4643216546131356461","00000000","000000","00000220251019MONEXT     ","                                       ","D","P","FRA","       ",{"$f":"VLOOKUP(G32,'Listes déroulantes'!G:L,6,FALSE)","v":"VAD  "},"                                                                                                    ","            ","            ","000000000000","    ","             ","                                                  ","20228380155          ","                                                                                                                                                                                                                            "]
["Enregistrement 26","oui","14000000Z01702817028XATRI    000021702892282513264KHYODHNJ313362025101960992700180008 00000000000022009782TI S224710856496           AVO000000008 RUE DES FLEURS    38250CM_08_COA/C/CL1AG1  000000000000     17028922822829306013493001      9356038                                        978020000000000002196                     CM_08                   2010250000001561700000000000021870000000000002200     20251020000000000013000000000004 0000046432165461313564610000000000000000000220251019MONEXT                                            DPFRA       PDP                                                                                                                              000000000001                                                                   20228380156                                                                                                                                                                                                                                      ","Refund","2025-10-20","CB","CM_08",22,0.13,0.04,0,0.01,"Débit","Particulier","FRA","CRE 26","14","000000","Z0","17028","17028","XA","TRI","    ","00","00","2","17028","92282","513264KHYODHNJ31336","20251019",{"$f":"VLOOKUP(G33,'Listes déroulantes'!G:I,3,FALSE)","v":"60992700180008 "},"0000000000002200","978","2","TI ","S","224710856496           ","AVO","00000000",{"$f":"VLOOKUP(G33,'Listes déroulantes'!G:O,9,FALSE)","v":"8 RUE DES FLEURS    "},"38",250,{"$f":"VLOOKUP(G33,'Listes déroulantes'!G:H,2,FALSE)","v":"CM_08_COA/C/CL1AG1  "},"000000000000","    "," ","17028","92282",{"$f":"VLOOKUP(G33,'Listes déroulantes'!G:N,8,FALSE)","v":"28293060134"},"93","001","      ",{"$f":"VLOOKUP(G33,'Listes déroulantes'!G:J,4,FALSE)","v":"9356038   "},"   ","                                  ","978","02","0000000000002196","                     ",{"$f":"VLOOKUP(G33,'Listes déroulantes'!G:M,7,FALSE)","v":"CM_08                   "},"201025","000000","15617","0000000000002187","0000000000002200"," ","    ","20251020","000000000013","000000000004"," ","00000","4643216546131356461","00000000","000000","00000220251019MONEXT     ","                                       ","D","P","FRA","       ",{"$f":"VLOOKUP(G33,'Listes déroulantes'!G:L,6,FALSE)","v":"PDP  "},"                                                                                                    ","            ","            ","000000000001","    ","             ","                                                  ","20228380156          ","                                                                                                                                                                                                                            "]
["Enregistrement 27","oui","14000000Z01702817028XATRI    000021702892282513264KHYODHNJ313372025101960992700180008 00000000000082009782TI S224710856495           AVO000000008 RUE DES FLEURS    39250CM_08_COA/C/CL1AG1  000000000000     17028922822829306013493001      9356038                                        978020000000000008184                     CM_08                   2010250000001561700000000000081510000000000008200     20251020000000000049000000000016 0000046432165461313564610000000000000000000220251019MONEXT                                            DPFRA       PDP                                                                                                                              000000000004                                                                   20228380157                                                                                                                                                                                                                                      ","Refund","2025-10-20","CB","CM_08",82,0.49,0.16,0,0.04,"Débit","Particulier","FRA","CRE 27","14","000000","Z0","17028","17028","XA","TRI","    ","00","00","2","17028","92282","513264KHYODHNJ31337","20251019",{"$f":"VLOOKUP(G34,'Listes déroulantes'!G:I,3,FALSE)","v":"60992700180008 "},"0000000000008200","978","2","TI ","S","224710856495           ","AVO","00000000",{"$f":"VLOOKUP(G34,'Listes déroulantes'!G:O,9,FALSE)","v":"8 RUE DES FLEURS    "},"39",250,{"$f":"VLOOKUP(G34,'Listes déroulantes'!G:H,2,FALSE)","v":"CM_08_COA/C/CL1AG1  "},"000000000000","    "," ","17028","92282",{"$f":"VLOOKUP(G34,'Listes déroulantes'!G:N,8,FALSE)","v":"28293060134"},"93","001","      ",{"$f":"VLOOKUP(G34,'Listes déroulantes'!G:J,4,FALSE)","v":"9356038   "},"   ","                                  ","978","02","0000000000008184","                     ",{"$f":"VLOOKUP(G34,'Listes déroulantes'!G:M,7,FALSE)","v":"CM_08                   "},"201025","000000","15617","0000000000008151","0000000000008200"," ","    ","20251020","000000000049","000000000016"," ","00000","4643216546131356461","00000000","000000","00000220251019MONEXT     ","                                       ","D","P","FRA","       ",{"$f":"VLOOKUP(G34,'Listes déroulantes'!G:L,6,FALSE)","v":"PDP  "},"                                                                                                    ","            ","            ","000000000004","    ","             ","                                                  ","20228380157          ","                                                                                                                                                                                                                            "]
["Enregistrement 28","non","CRE NON ACTIF","Refund","2022-12-19","CB","CM_41_PDPAG2",40.25,0.24,0.08,0,0,"Débit","Particulier","FRA","CRE 28","14","000000","Z0","17028","17028","XA","TRI","    ","00","00","2","17028","92282","513264KHYODHNJ31338","20221218",{"$f":"VLOOKUP(G35,'Listes déroulantes'!G:I,3,FALSE)","v":"60904100190001 "},"0000000000004025","978","2","TI ","S","224710856496           ","AVO","00000000",{"$f":"VLOOKUP(G35,'Listes déroulantes'!G:O,9,FALSE)","v":"41 RUE DU TEST      "},"40",250,{"$f":"VLOOKUP(G35,'Listes déroulantes'!G:H,2,FALSE)","v":"CM_41               "},"000000000000","    "," ","17028","92282",{"$f":"VLOOKUP(G35,'Listes déroulantes'!G:N,8,FALSE)","v":"28293060241"},"93","001","      ",{"$f":"VLOOKUP(G35,'Listes déroulantes'!G:J,4,FALSE)","v":"9556041   "},"   ","                                  ","978","02","0000000000004017","                     ",{"$f":"VLOOKUP(G35,'Listes déroulantes'!G:M,7,FALSE)","v":"CM_41                   "},"191222","000000","15617","0000000000004001","0000000000004025"," ","    ","20221219","000000000024","000000000008"," ","00000","4643216546131356461","00000000","000000","00000220221218MONEXT     ","                                       ","D","P","FRA","       ",{"$f":"VLOOKUP(G35,'Listes déroulantes'!G:L,6,FALSE)","v":"PDP  "},"                                                                                                    ","            ","            ","000000000000","    ","             ","                                                  ","20228380158          ","                                                                                                                                                                                                                            "]
["Enregistrement 29","non","CRE NON ACTIF","Refund","2022-12-19","CB","CM_33_PDP",22,0.13,0.04,0,0,"Débit","Particulier","FRA","CRE 29","14","000000","Z0","17028","17028","XA","TRI","    ","00","00","2","17028","92282","513264KHYODHNJ31339","20221218",{"$f":"VLOOKUP(G36,'Listes déroulantes'!G:I,3,FALSE)","v":"60903300190001 "},"0000000000002200","978","2","TI ","S","224710856495           ","AVO","00000000",{"$f":"VLOOKUP(G36,'Listes déroulantes'!G:O,9,FALSE)","v":"33 RUE DU TEST      "},"41",250,{"$f":"VLOOKUP(G36,'Listes déroulantes'!G:H,2,FALSE)","v":"CM_33               "},"000000000000","    "," ","17028","92282",{"$f":"VLOOKUP(G36,'Listes déroulantes'!G:N,8,FALSE)","v":"28293060233"},"93","001","      ",{"$f":"VLOOKUP(G36,'Listes déroulantes'!G:J,4,FALSE)","v":"9556033   "},"   ","                                  ","978","02","0000000000002196","                     ",{"$f":"VLOOKUP(G36,'Listes déroulantes'!G:M,7,FALSE)","v":"CM_33                   "},"191222","000000","15617","0000000000002187","0000000000002200"," ","    ","20221219","000000000013","000000000004"," ","00000","4643216546131356461","00000000","000000","00000220221218MONEXT     ","                                       ","D","P","FRA","       ",{"$f":"VLOOKUP(G36,'Listes déroulantes'!G:L,6,FALSE)","v":"PDP  "},"                                                                                                    ","            ","            ","000000000000","    ","             ","                                                  ","20228380159          ","                                                                                                                                                                                                                            "]
["Enregistrement 30","non","CRE NON ACTIF","Refund","2022-12-19","CB","CM_33_PDP",12,7.0000000000000007E-2,0.02,0,0,"Débit","Particulier","FRA","CRE 30","14","000000","Z0","17028","17028","XA","TRI","    ","00","00","2","17028","92282","513264KHYODHNJ31340","20221218",{"$f":"VLOOKUP(G37,'Listes déroulantes'!G:I,3,FALSE)","v":"60903300190001 "},"0000000000001200","978","2","TI ","S","224710856496           ","AVO","00000000",{"$f":"VLOOKUP(G37,'Listes déroulantes'!G:O,9,FALSE)","v":"33 RUE DU TEST      "},"42",250,{"$f":"VLOOKUP(G37,'Listes déroulantes'!G:H,2,FALSE)","v":"CM_33               "},"000000000000","    "," ","17028","92282",{"$f":"VLOOKUP(G37,'Listes déroulantes'!G:N,8,FALSE)","v":"28293060233"},"93","001","      ",{"$f":"VLOOKUP(G37,'Listes déroulantes'!G:J,4,FALSE)","v":"9556033   "},"   ","                                  ","978","02","0000000000001198","                     ",{"$f":"VLOOKUP(G37,'Listes déroulantes'!G:M,7,FALSE)","v":"CM_33                   "},"191222","000000","15617","0000000000001193","0000000000001200"," ","    ","20221219","000000000007","000000000002"," ","00000","4643216546131356461","00000000","000000","00000220221218MONEXT     ","                                       ","D","P","FRA","       ",{"$f":"VLOOKUP(G37,'Listes déroulantes'!G:L,6,FALSE)","v":"PDP  "},"                                                                                                    ","            ","            ","000000000000","    ","             ","                                                  ","20228380160          ","                                                                                                                                                                                                                            "]
["Enregistrement 31","non","CRE NON ACTIF","Refund","2022-12-19","CB","CM_34_AG1",22.5,0,0.05,0,0,"Débit","Particulier","FRA","CRE 31","14","000000","Z0","17028","17028","XA","TRI","    ","00","00","2","17028","92282","513264KHYODHNJ31341","20221218",{"$f":"VLOOKUP(G38,'Listes déroulantes'!G:I,3,FALSE)","v":"60903400190001 "},"0000000000002250","978","2","TI ","S","224710856495           ","AVO","00000000",{"$f":"VLOOKUP(G38,'Listes déroulantes'!G:O,9,FALSE)","v":"34 RUE DU TEST      "},"43",250,{"$f":"VLOOKUP(G38,'Listes déroulantes'!G:H,2,FALSE)","v":"CM_34_AG1           "},"000000000000","    "," ","17028","92282",{"$f":"VLOOKUP(G38,'Listes déroulantes'!G:N,8,FALSE)","v":"28293060234"},"93","001","      ",{"$f":"VLOOKUP(G38,'Listes déroulantes'!G:J,4,FALSE)","v":"9556034   "},"   ","                                  ","978","02","0000000000002245","                     ",{"$f":"VLOOKUP(G38,'Listes déroulantes'!G:M,7,FALSE)","v":"CM_34                   "},"191222","000000","15617","0000000000002250","0000000000002250"," ","    ","20221219","000000000000","000000000005"," ","00000","4643216546131356461","00000000","000000","00000220221218MONEXT     ","                                       ","D","P","FRA","       ",{"$f":"VLOOKUP(G38,'Listes déroulantes'!G:L,6,FALSE)","v":"VAD  "},"                                                                                                    ","            ","            ","000000000000","    ","             ","                                                  ","20228380161          ","                                                                                                                                                                                                                            "]
["Enregistrement 32","non","CRE NON ACTIF","Refund","2022-12-19","CB","CM_32_VAD",27,0,1,0,0,"Débit","Particulier","FRA","CRE 32","14","000000","Z0","17028","17028","XA","TRI","    ","00","00","2","17028","92282","513264KHYODHNJ31342","20221218",{"$f":"VLOOKUP(G39,'Listes déroulantes'!G:I,3,FALSE)","v":"60903200190001 "},"0000000000002700","978","2","TI ","S","224710856496           ","AVO","00000000",{"$f":"VLOOKUP(G39,'Listes déroulantes'!G:O,9,FALSE)","v":"32 RUE DU TEST      "},"44",250,{"$f":"VLOOKUP(G39,'Listes déroulantes'!G:H,2,FALSE)","v":"CM_32               "},"000000000000","    "," ","17028","92282",{"$f":"VLOOKUP(G39,'Listes déroulantes'!G:N,8,FALSE)","v":"28293060232"},"93","001","      ",{"$f":"VLOOKUP(G39,'Listes déroulantes'!G:J,4,FALSE)","v":"9556032   "},"   ","                                  ","978","02","0000000000002600","                     ",{"$f":"VLOOKUP(G39,'Listes déroulantes'!G:M,7,FALSE)","v":"CM_32                   "},"191222","000000","15617","0000000000002700","0000000000002700"," ","    ","20221219","000000000000","000000000100"," ","00000","4643216546131356461","00000000","000000","00000220221218MONEXT     ","                                       ","D","P","FRA","       ",{"$f":"VLOOKUP(G39,'Listes déroulantes'!G:L,6,FALSE)","v":"VAD  "},"                                                                                                    ","            ","            ","000000000000","    ","             ","                                                  ","20228380162          ","                                                                                                                                                                                                                            "]
["Enregistrement 33","non","CRE NON ACTIF","Refund","2022-12-19","CB","CM_36_PDPAG1",45.22,0,0.5,0,0,"Débit","Particulier","FRA","CRE 33","14","000000","Z0","17028","17028","XA","TRI","    ","00","00","2","17028","92282","513264KHYODHNJ31343","20221218",{"$f":"VLOOKUP(G40,'Listes déroulantes'!G:I,3,FALSE)","v":"60903600190001 "},"0000000000004522","978","2","TI ","S","224710856495           ","AVO","00000000",{"$f":"VLOOKUP(G40,'Listes déroulantes'!G:O,9,FALSE)","v":"36 RUE DU TEST      "},"45",250,{"$f":"VLOOKUP(G40,'Listes déroulantes'!G:H,2,FALSE)","v":"CM_36               "},"000000000000","    "," ","17028","92282",{"$f":"VLOOKUP(G40,'Listes déroulantes'!G:N,8,FALSE)","v":"28293060236"},"93","001","      ",{"$f":"VLOOKUP(G40,'Listes déroulantes'!G:J,4,FALSE)","v":"9556036   "},"   ","                                  ","978","02","0000000000004472","                     ",{"$f":"VLOOKUP(G40,'Listes déroulantes'!G:M,7,FALSE)","v":"CM_36                   "},"191222","000000","15617","0000000000004522","0000000000004522"," ","    ","20221219","000000000000","000000000050"," ","00000","4643216546131356461","00000000","000000","00000220221218MONEXT     ","                                       ","D","P","FRA","       ",{"$f":"VLOOKUP(G40,'Listes déroulantes'!G:L,6,FALSE)","v":"PDP  "},"                                                                                                    ","            ","            ","000000000000","    ","             ","                                                  ","20228380163          ","                                                                                                                                                                                                                            "]
["Enregistrement 34","non","CRE NON ACTIF","Refund","2022-12-19","CB","CM_37_VADAG1",28,0,1,0,0,"Débit","Particulier","FRA","CRE 34","14","000000","Z0","17028","17028","XA","TRI","    ","00","00","2","17028","92282","513264KHYODHNJ31344","20221218",{"$f":"VLOOKUP(G41,'Listes déroulantes'!G:I,3,FALSE)","v":"60903700190001 "},"0000000000002800","978","2","TI ","S","224710856496           ","AVO","00000000",{"$f":"VLOOKUP(G41,'Listes déroulantes'!G:O,9,FALSE)","v":"37 RUE DU TEST      "},"46",250,{"$f":"VLOOKUP(G41,'Listes déroulantes'!G:H,2,FALSE)","v":"CM_37               "},"000000000000","    "," ","17028","92282",{"$f":"VLOOKUP(G41,'Listes déroulantes'!G:N,8,FALSE)","v":"28293060237"},"93","001","      ",{"$f":"VLOOKUP(G41,'Listes déroulantes'!G:J,4,FALSE)","v":"9556037   "},"   ","                                  ","978","02","0000000000002700","                     ",{"$f":"VLOOKUP(G41,'Listes déroulantes'!G:M,7,FALSE)","v":"CM_37                   "},"191222","000000","15617","0000000000002800","0000000000002800"," ","    ","20221219","000000000000","000000000100"," ","00000","4643216546131356461","00000000","000000","00000220221218MONEXT     ","                                       ","D","P","FRA","       ",{"$f":"VLOOKUP(G41,'Listes déroulantes'!G:L,6,FALSE)","v":"VAD  "},"                                                                                                    ","            ","            ","000000000000","    ","             ","                                                  ","20228380164          ","                                                                                                                                                                                                                            "]
["Enregistrement 35","non","CRE NON ACTIF","Refund","2022-09-26","CB","CM_16_RMFEC VAD2",28.5,0,0,0,0.8,"Débit","Particulier","FRA","CRE 35","14","000000","Z0","17028","17028","XA","TRI","    ","00","00","2","17028","92282","513264KHYODHNJ31345","20220925",{"$f":"VLOOKUP(G42,'Listes déroulantes'!G:I,3,FALSE)","v":"60929700180001 "},"0000000000002850","978","2","TI ","S","224710856495           ","AVO","00000000",{"$f":"VLOOKUP(G42,'Listes déroulantes'!G:O,9,FALSE)","v":"27 AVENUE DE LA CROI"},"47",250,{"$f":"VLOOKUP(G42,'Listes déroulantes'!G:H,2,FALSE)","v":"CM_16_RMFEC         "},"000000000000","    "," ","17028","92282",{"$f":"VLOOKUP(G42,'Listes déroulantes'!G:N,8,FALSE)","v":"28293060137"},"93","001","      ",{"$f":"VLOOKUP(G42,'Listes déroulantes'!G:J,4,FALSE)","v":"9256127   "},"   ","                                  ","978","02","0000000000002850","                     ",{"$f":"VLOOKUP(G42,'Listes déroulantes'!G:M,7,FALSE)","v":"CM_16_RMFEC VAD         "},"260922","000000","15617","0000000000002850","0000000000002850"," ","    ","20220926","000000000000","000000000000"," ","00000","4643216546131356461","00000000","000000","00000220220925MONEXT     ","                                       ","D","P","FRA","       ",{"$f":"VLOOKUP(G42,'Listes déroulantes'!G:L,6,FALSE)","v":"VAD  "},"                                                                                                    ","            ","            ","000000000080","    ","             ","                                                  ","20228380165          ","                                                                                                                                                                                                                            "]
["Enregistrement 36","non","CRE NON ACTIF","Refund","2022-09-26","CB","SAS MONEXT PDP",265,0,1,0,0.8,"Débit","Particulier","FRA","CRE 36","14","000000","Z0","17028","17028","XA","TRI","    ","00","00","2","17028","92282","513264KHYODHNJ31346","20220925",{"$f":"VLOOKUP(G43,'Listes déroulantes'!G:I,3,FALSE)","v":"50318500100032 "},"0000000000026500","978","2","TI ","S","224710856496           ","AVO","00000000",{"$f":"VLOOKUP(G43,'Listes déroulantes'!G:O,9,FALSE)","v":"260 RUE CLAUDE NICOL"},"48",250,{"$f":"VLOOKUP(G43,'Listes déroulantes'!G:H,2,FALSE)","v":"SAS MONEXT          "},"000000000000","    "," ","17028","92282",{"$f":"VLOOKUP(G43,'Listes déroulantes'!G:N,8,FALSE)","v":"20289045644"},"93","001","      ",{"$f":"VLOOKUP(G43,'Listes déroulantes'!G:J,4,FALSE)","v":"9255001   "},"   ","                                  ","978","02","0000000000026400","                     ",{"$f":"VLOOKUP(G43,'Listes déroulantes'!G:M,7,FALSE)","v":"MONEXT                  "},"260922","000000","15617","0000000000026500","0000000000026500"," ","    ","20220926","000000000000","000000000100"," ","00000","4643216546131356461","00000000","000000","00000220220925MONEXT     ","                                       ","D","P","FRA","       ",{"$f":"VLOOKUP(G43,'Listes déroulantes'!G:L,6,FALSE)","v":"PDP  "},"                                                                                                    ","            ","            ","000000000080","    ","             ","                                                  ","20228380166          ","                                                                                                                                                                                                                            "]
["Enregistrement 37","non","CRE NON ACTIF","Refund","2022-09-26","CB","SAS MONEXT PDP",266,0,1,0,0.8,"Débit","Particulier","FRA","CRE 37","14","000000","Z0","17028","17028","XA","TRI","    ","00","00","2","17028","92282","513264KHYODHNJ31347","20220925",{"$f":"VLOOKUP(G44,'Listes déroulantes'!G:I,3,FALSE)","v":"50318500100032 "},"0000000000026600","978","2","TI ","S","224710856495           ","AVO","00000000",{"$f":"VLOOKUP(G44,'Listes déroulantes'!G:O,9,FALSE)","v":"260 RUE CLAUDE NICOL"},"49",250,{"$f":"VLOOKUP(G44,'Listes déroulantes'!G:H,2,FALSE)","v":"SAS MONEXT          "},"000000000000","    "," ","17028","92282",{"$f":"VLOOKUP(G44,'Listes déroulantes'!G:N,8,FALSE)","v":"20289045644"},"93","001","      ",{"$f":"VLOOKUP(G44,'Listes déroulantes'!G:J,4,FALSE)","v":"9255001   "},"   ","                                  ","978","02","0000000000026500","                     ",{"$f":"VLOOKUP(G44,'Listes déroulantes'!G:M,7,FALSE)","v":"MONEXT                  "},"260922","000000","15617","0000000000026600","0000000000026600"," ","    ","20220926","000000000000","000000000100"," ","00000","4643216546131356461","00000000","000000","00000220220925MONEXT     ","                                       ","D","P","FRA","       ",{"$f":"VLOOKUP(G44,'Listes déroulantes'!G:L,6,FALSE)","v":"PDP  "},"                                                                                                    ","            ","            ","000000000080","    ","             ","                                                  ","20228380167          ","                                                                                                                                                                                                                            "]
["Enregistrement 38","non","CRE NON ACTIF","Refund","2022-09-26","CB","SAS MONEXT PDP",267,0,1,0,0.8,"Débit","Particulier","FRA","CRE 38","14","000000","Z0","17028","17028","XA","TRI","    ","00","00","2","17028","92282","513264KHYODHNJ31348","20220925",{"$f":"VLOOKUP(G45,'Listes déroulantes'!G:I,3,FALSE)","v":"50318500100032 "},"0000000000026700","978","2","TI ","S","224710856496           ","AVO","00000000",{"$f":"VLOOKUP(G45,'Listes déroulantes'!G:O,9,FALSE)","v":"260 RUE CLAUDE NICOL"},"50",250,{"$f":"VLOOKUP(G45,'Listes déroulantes'!G:H,2,FALSE)","v":"SAS MONEXT          "},"000000000000","    "," ","17028","92282",{"$f":"VLOOKUP(G45,'Listes déroulantes'!G:N,8,FALSE)","v":"20289045644"},"93","001","      ",{"$f":"VLOOKUP(G45,'Listes déroulantes'!G:J,4,FALSE)","v":"9255001   "},"   ","                                  ","978","02","0000000000026600","                     ",{"$f":"VLOOKUP(G45,'Listes déroulantes'!G:M,7,FALSE)","v":"MONEXT                  "},"260922","000000","15617","0000000000026700","0000000000026700"," ","    ","20220926","000000000000","000000000100"," ","00000","4643216546131356461","00000000","000000","00000220220925MONEXT     ","                                       ","D","P","FRA","       ",{"$f":"VLOOKUP(G45,'Listes déroulantes'!G:L,6,FALSE)","v":"PDP  "},"                                                                                                    ","            ","            ","000000000080","    ","             ","                                                  ","20228380168          ","                                                                                                                                                                                                                            "]
["Enregistrement 39","non","CRE NON ACTIF","Refund","2022-09-26","CB","SAS MONEXT PDP",268,0,1,0,0.8,"Débit","Particulier","FRA","CRE 39","14","000000","Z0","17028","17028","XA","TRI","    ","00","00","2","17028","92282","513264KHYODHNJ31349","20220925",{"$f":"VLOOKUP(G46,'Listes déroulantes'!G:I,3,FALSE)","v":"50318500100032 "},"0000000000026800","978","2","TI ","S","224710856495           ","AVO","00000000",{"$f":"VLOOKUP(G46,'Listes déroulantes'!G:O,9,FALSE)","v":"260 RUE CLAUDE NICOL"},"51",250,{"$f":"VLOOKUP(G46,'Listes déroulantes'!G:H,2,FALSE)","v":"SAS MONEXT          "},"000000000000","    "," ","17028","92282",{"$f":"VLOOKUP(G46,'Listes déroulantes'!G:N,8,FALSE)","v":"20289045644"},"93","001","      ",{"$f":"VLOOKUP(G46,'Listes déroulantes'!G:J,4,FALSE)","v":"9255001   "},"   ","                                  ","978","02","0000000000026700","                     ",{"$f":"VLOOKUP(G46,'Listes déroulantes'!G:M,7,FALSE)","v":"MONEXT                  "},"260922","000000","15617","0000000000026800","0000000000026800"," ","    ","20220926","000000000000","000000000100"," ","00000","4643216546131356461","00000000","000000","00000220220925MONEXT     ","                                       ","D","P","FRA","       ",{"$f":"VLOOKUP(G46,'Listes déroulantes'!G:L,6,FALSE)","v":"PDP  "},"                                                                                                    ","            ","            ","000000000080","    ","             ","                                                  ","20228380169          ","                                                                                                                                                                                                                            "]
["Enregistrement 40","non","CRE NON ACTIF","Refund","2022-09-26","CB","SAS MONEXT PDP",269,0,1,0,0.8,"Débit","Particulier","FRA","CRE 40","14","000000","Z0","17028","17028","XA","TRI","    ","00","00","2","17028","92282","513264KHYODHNJ31350","20220925",{"$f":"VLOOKUP(G47,'Listes déroulantes'!G:I,3,FALSE)","v":"50318500100032 "},"0000000000026900","978","2","TI ","S","224710856496           ","AVO","00000000",{"$f":"VLOOKUP(G47,'Listes déroulantes'!G:O,9,FALSE)","v":"260 RUE CLAUDE NICOL"},"52",250,{"$f":"VLOOKUP(G47,'Listes déroulantes'!G:H,2,FALSE)","v":"SAS MONEXT          "},"000000000000","    "," ","17028","92282",{"$f":"VLOOKUP(G47,'Listes déroulantes'!G:N,8,FALSE)","v":"20289045644"},"93","001","      ",{"$f":"VLOOKUP(G47,'Listes déroulantes'!G:J,4,FALSE)","v":"9255001   "},"   ","                                  ","978","02","0000000000026800","                     ",{"$f":"VLOOKUP(G47,'Listes déroulantes'!G:M,7,FALSE)","v":"MONEXT                  "},"260922","000000","15617","0000000000026900","0000000000026900"," ","    ","20220926","000000000000","000000000100"," ","00000","4643216546131356461","00000000","000000","00000220220925MONEXT     ","                                       ","D","P","FRA","       ",{"$f":"VLOOKUP(G47,'Listes déroulantes'!G:L,6,FALSE)","v":"PDP  "},"                                                                                                    ","            ","            ","000000000080","    ","             ","                                                  ","20228380170          ","                                                                                                                                                                                                                            "]
["Enregistrement 41","non",{"$f":"IF(B48=\"OUI\",CONCATENATE(Q48,R48,S48,T48,U48,V48,W48,X48,Y48,Z48,AA48,AB48,AC48,AD48,AE48,AF48,AG48,AH48,AI48,AJ48,AK48,AL48,AM48,AN48,AO48,AP48,AQ48,AR48,AS48,AT48,AU48,AV48,AW48,AX48,AY48,AZ48,BA48,BB48,BC48,BD48,BE48,BF48,BG48,BH48,BI48,BJ48,BK48,BL48,BM48,BN48,BO48,BP48,BQ48,BR48,BS48,BT48,BU48,BV48,BW48,BX48,BY48,BZ48,CA48,CB48,CC48,CD48,CE48,CF48,CG14,CH48,CI48,CJ48),\"CRE NON ACTIF\")","v":"CRE NON ACTIF"},"Refund","2022-09-26","CB","SAS MONEXT PDP",270,0,1,0,0.8,"Débit","Particulier","FRA","CRE 41","14","000000","Z0","17028","17028","XA","TRI","    ","00","00","2","17028","92282","513264KHYODHNJ31351","20220925",{"$f":"VLOOKUP(G48,'Listes déroulantes'!G:I,3,FALSE)","v":"50318500100032 "},"0000000000027000","978","2","TI ","S","224710856495           ","AVO","00000000",{"$f":"VLOOKUP(G48,'Listes déroulantes'!G:O,9,FALSE)","v":"260 RUE CLAUDE NICOL"},"53",250,{"$f":"VLOOKUP(G48,'Listes déroulantes'!G:H,2,FALSE)","v":"SAS MONEXT          "},"000000000000","    "," ","17028","92282",{"$f":"VLOOKUP(G48,'Listes déroulantes'!G:N,8,FALSE)","v":"20289045644"},"93","001","      ",{"$f":"VLOOKUP(G48,'Listes déroulantes'!G:J,4,FALSE)","v":"9255001   "},"   ","                                  ","978","02","0000000000026900","                     ",{"$f":"VLOOKUP(G48,'Listes déroulantes'!G:M,7,FALSE)","v":"MONEXT                  "},"260922","000000","15617","0000000000027000","0000000000027000"," ","    ","20220926","000000000000","000000000100"," ","00000","4643216546131356461","00000000","000000","00000220220925MONEXT     ","                                       ","D","P","FRA","       ",{"$f":"VLOOKUP(G48,'Listes déroulantes'!G:L,6,FALSE)","v":"PDP  "},"                                                                                                    ","            ","            ","000000000080","    ","             ","                                                  ","20228380171          ","                                                                                                                                                                                                                            "]
[null,null,null,null,null,null,null,null,null,null,null,null,null,null,null,null,null,null,null,null,null,null,null,null,null,null,null,null,null,null,null,null,null,null,null,null,null,null,null,null,null,null,null,null,null,null,null,null,null,null,null,null,null,null,null,null,null,null,null,null,null,null,null,null,null,null,null,null,null,null,null,null,null,null,null,null,null,null,null,null,null,null,null,null,null,{"$f":"LEN(CH8)","v":12},{"$f":"LEN(CI8)","v":12},{"$f":"LEN(CJ8)","v":4}]
[null,null,null,null,null,null,null,null,null,null,null,null,null,null,null,null,{"$f":"LEN(Q8)","v":2},{"$f":"LEN(R8)","v":6},2,5,5,2,3,4,2,2,1,5,5,19,8,15,16,3,1,3,1,23,3,8,20,2,3,20,12,4,1,5,5,11,2,3,6,{"$f":"LEN(BB8)","v":10},3,34,3,2,16,21,24,6,6,5,16,16,1,4,8,12,12,1,5,19,8,6,25,39,1,1,3,{"$f":"LEN(CD8)","v":7},5,100,{"$f":"LEN(CG8)","v":12},12,12,4,13,50,{"$f":"LEN(CM8)","v":21},220,0,0,0,0,0,0,0,0,0,0,0,0,0,0,0,0,0,0,0,0,0,0,0,0,0,0,0,0,0,0,0,0,0,0,0,0,0,0,0,0,0,0,0,0,0,0,0,0,0,0,0,0,0,{"$f":"LEN(EP8)","v":0},0,0,0,0,0,0,0,0,0,0,0,0,0,0,0,0,0,0,0,0,0,0,0,0,0]
[null,null,null,null,null,null,null,null,null,null,null,null,null,null,null,null,null,null,null,null,null,null,null,null,null,null,null,null,null,null,null,null,null,null,null,null,null,null,null,null,{"$f":"LEN(AO9)","v":20},null,null,{"$f":"LEN(AR9)","v":20},null,null,null,null,null,null,null,null,null,null,null,null,null,null,null,null,null,null,null,null,null,null,null,null,null,null,null,null,null,null,null,null,null,null,null,null,null,null,null,null,{"$f":"LEN(CG9)","v":12},12,12,4,13,50,21,220]
[null,null,null,null,null,null,null,null,null,null,null,null,null,null,null,null,null,null,null,null,null,null,null,null,null,null,null,null,null,null,null,null,null,null,null,null,null,null,null,null,20,null,null,20,null,null,null,null,null,null,null,null,null,null,null,null,null,null,null,null,null,null,null,null,null,null,null,null,null,null,null,null,null,null,null,null,null,null,null,null,null,null,null,null,{"$f":"LEN(CG10)","v":12},12,12,4,13,50,21,220]
[null,null,null,null,null,null,null,null,null,null,null,null,null,null,null,null,null,null,null,null,null,null,null,null,null,null,null,null,null,null,null,null,null,null,null,null,null,null,null,null,20,null,null,20,null,null,null,null,null,null,null,null,null,null,null,null,null,null,null,null,null,null,null,null,null,null,null,null,null,null,null,null,null,null,null,null,null,null,null,null,null,null,null,null,{"$f":"LEN(CG11)","v":12},12,12,4,13,50,21,220]
[null,null,null,null,null,null,null,null,null,null,null,null,null,null,null,null,null,null,null,null,null,null,null,null,null,null,null,null,null,null,null,null,null,null,null,null,null,null,null,null,20,null,null,20,null,null,null,null,null,null,null,null,null,null,null,null,null,null,null,null,null,null,null,null,null,null,null,null,null,null,null,null,null,null,null,null,null,null,null,null,null,null,null,null,{"$f":"LEN(CG12)","v":12},12,12,4,13,50,21,220]
[null,null,null,null,null,null,null,null,null,null,null,null,null,null,null,null,null,null,null,null,null,null,null,null,null,null,null,null,null,null,null,null,null,null,null,null,null,null,null,null,20,null,null,20,null,null,null,null,null,null,null,null,null,null,null,null,null,null,null,null,null,null,null,null,null,null,null,null,null,null,null,null,null,null,null,null,null,null,null,null,null,null,null,null,{"$f":"LEN(CG13)","v":12},12,12,4,13,50,21,220]
[null,null,null,null,null,null,null,null,null,null,null,null,null,null,null,null,null,null,null,null,null,null,null,null,null,null,null,null,null,null,null,null,null,null,null,null,null,null,null,null,20,null,null,20,null,null,null,null,null,null,null,null,null,null,null,null,null,null,null,null,null,null,null,null,null,null,null,null,null,null,null,null,null,null,null,null,null,null,null,null,null,null,null,null,{"$f":"LEN(CG14)","v":12},12,12,4,13,50,21,220]
[null,null,null,null,null,null,null,null,null,null,null,null,null,null,null,null,null,null,null,null,null,null,null,null,null,null,null,null,null,null,null,null,null,null,null,null,null,null,null,null,20,null,null,20,null,null,null,null,null,null,null,null,null,null,null,null,null,null,null,null,null,null,null,null,null,null,null,null,null,null,null,null,null,null,null,null,null,null,null,null,null,null,null,null,{"$f":"LEN(CG15)","v":12},12,12,4,13,50,21,220]
[null,null,null,null,null,null,null,null,null,null,null,null,null,null,null,null,null,null,null,null,null,null,null,null,null,null,null,null,null,null,null,null,null,null,null,null,null,null,null,null,20,null,null,20,null,null,null,null,null,null,null,null,null,null,null,null,null,null,null,null,null,null,null,null,null,null,null,null,null,null,null,null,null,null,null,null,null,null,null,null,null,null,null,null,{"$f":"LEN(CG16)","v":12},12,12,4,13,50,21,220]
[null,null,null,null,null,null,null,null,null,null,null,null,null,null,null,null,null,null,null,null,null,null,null,null,null,null,null,null,null,null,null,null,null,null,null,null,null,null,null,null,20,null,null,20,null,null,null,null,null,null,null,null,null,null,null,null,null,null,null,null,null,null,null,null,null,null,null,null,null,null,null,null,null,null,null,null,null,null,null,null,null,null,null,null,{"$f":"LEN(CG17)","v":12},12,12,4,13,50,21,220]
[null,null,null,null,null,null,null,null,null,null,null,null,null,null,null,null,null,null,null,null,null,null,null,null,null,null,null,null,null,null,null,null,null,null,null,null,null,null,null,null,20,null,null,20,null,null,null,null,null,null,null,null,null,null,null,null,null,null,null,null,null,null,null,null,null,null,null,null,null,null,null,null,null,null,null,null,null,null,null,null,null,null,null,null,{"$f":"LEN(CG18)","v":12},12,12,4,13,50,21,220]
[null,null,null,null,null,null,null,null,null,null,null,null,null,null,null,null,null,null,null,null,null,null,null,null,null,null,null,null,null,null,null,null,null,null,null,null,null,null,null,null,20,null,null,20,null,null,null,null,null,null,null,null,null,null,null,null,null,null,null,null,null,null,null,null,null,null,null,null,null,null,null,null,null,null,null,null,null,null,null,null,null,null,null,null,{"$f":"LEN(CG19)","v":12},12,12,4,13,50,21,220]
[null,null,null,null,null,null,null,null,null,null,null,null,null,null,null,null,null,null,null,null,null,null,null,null,null,null,null,null,null,null,null,null,null,null,null,null,null,null,null,null,20,null,null,20,null,null,null,null,null,null,null,null,null,null,null,null,null,null,null,null,null,null,null,null,null,null,null,null,null,null,null,null,null,null,null,null,null,null,null,null,null,null,null,null,{"$f":"LEN(CG20)","v":12},12,12,4,13,50,21,220]
[null,null,null,null,null,null,null,null,null,null,null,null,null,null,null,null,null,null,null,null,null,null,null,null,null,null,null,null,null,null,null,null,null,null,null,null,null,null,null,null,20,null,null,20,null,null,null,null,null,null,null,null,null,null,null,null,null,null,null,null,null,null,null,null,null,null,null,null,null,null,null,null,null,null,null,null,null,null,null,null,null,null,null,null,{"$f":"LEN(CG21)","v":12},12,12,4,13,50,21,220]
[null,null,null,null,null,null,null,null,null,null,null,null,null,null,null,null,null,null,null,null,null,null,null,null,null,null,null,null,null,null,null,null,null,null,null,null,null,null,null,null,20,null,null,20,null,null,null,null,null,null,null,null,null,null,null,null,null,null,null,null,null,null,null,null,null,null,null,null,null,null,null,null,null,null,null,null,null,null,null,null,null,null,null,null,{"$f":"LEN(CG22)","v":12},12,12,4,13,50,21,220]
[null,null,null,null,null,null,null,null,null,null,null,null,null,null,null,null,null,null,null,null,null,null,null,null,null,null,null,null,null,null,null,null,null,null,null,null,null,null,null,null,20,null,null,20,null,null,null,null,null,null,null,null,null,null,null,null,null,null,null,null,null,null,null,null,null,null,null,null,null,null,null,null,null,null,null,null,null,null,null,null,null,null,null,null,{"$f":"LEN(CG23)","v":12},12,12,4,13,50,21,220]
[null,null,null,null,null,null,null,null,null,null,null,null,null,null,null,null,null,null,null,null,null,null,null,null,null,null,null,null,null,null,null,null,null,null,null,null,null,null,null,null,20,null,null,20,null,null,null,null,null,null,null,null,null,null,null,null,null,null,null,null,null,null,null,null,null,null,null,null,null,null,null,null,null,null,null,null,null,null,null,null,null,null,null,null,{"$f":"LEN(CG24)","v":12},12,12,4,13,50,21,220]
[null,null,null,null,null,null,null,null,null,null,null,null,null,null,null,null,null,null,null,null,null,null,null,null,null,null,null,null,null,null,null,null,null,null,null,null,null,null,null,null,20,null,null,20,null,null,null,null,null,null,null,null,null,null,null,null,null,null,null,null,null,null,null,null,null,null,null,null,null,null,null,null,null,null,null,null,null,null,null,null,null,null,null,null,{"$f":"LEN(CG25)","v":12},12,12,4,13,50,21,220]
[null,null,null,null,null,null,null,null,null,null,null,null,null,null,null,null,null,null,null,null,null,null,null,null,null,null,null,null,null,null,null,null,null,null,null,null,null,null,null,null,20,null,null,20,null,null,null,null,null,null,null,null,null,null,null,null,null,null,null,null,null,null,null,null,null,null,null,null,null,null,null,null,null,null,null,null,null,null,null,null,null,null,null,null,{"$f":"LEN(CG26)","v":12},12,12,4,13,50,21,220]
[null,null,null,null,null,null,null,null,null,null,null,null,null,null,null,null,null,null,null,null,null,null,null,null,null,null,null,null,null,null,null,null,null,null,null,null,null,null,null,null,20,null,null,20,null,null,null,null,null,null,null,null,null,null,null,null,null,null,null,null,null,null,null,null,null,null,null,null,null,null,null,null,null,null,null,null,null,null,null,null,null,null,null,null,{"$f":"LEN(CG27)","v":12},12,12,4,13,50,21,220]
[null,null,null,null,null,null,null,null,null,null,null,null,null,null,null,null,null,null,null,null,null,null,null,null,null,null,null,null,null,null,null,null,null,null,null,null,null,null,null,null,20,null,null,20,null,null,null,null,null,null,null,null,null,null,null,null,null,null,null,null,null,null,null,null,null,null,null,null,null,null,null,null,null,null,null,null,null,null,null,null,null,null,null,null,{"$f":"LEN(CG28)","v":12},12,12,4,13,50,21,220]
[null,null,null,null,null,null,null,null,null,null,null,null,null,null,null,null,null,null,null,null,null,null,null,null,null,null,null,null,null,null,null,null,null,null,null,null,null,null,null,null,20,null,null,null,null,null,null,null,null,null,null,null,null,null,null,null,null,null,null,null,null,null,null,null,null,null,null,null,null,null,null,null,null,null,null,null,null,null,null,null,null,null,null,null,{"$f":"LEN(CG29)","v":12},12,12,4,13,50,21,220]
[null,null,null,null,null,null,null,null,null,null,null,null,null,null,null,null,null,null,null,null,null,null,null,null,null,null,null,null,null,null,null,null,null,null,null,null,null,null,null,null,20,null,null,null,null,null,null,null,null,null,null,null,null,null,null,null,null,null,null,null,null,null,null,null,null,null,null,null,null,null,null,null,null,null,null,null,null,null,null,null,null,null,null,null,{"$f":"LEN(CG30)","v":12},12,12,4,13,50,21,220]
[null,null,null,null,null,null,null,null,null,null,null,null,null,null,null,null,null,null,null,null,null,null,null,null,null,null,null,null,null,null,null,null,null,null,null,null,null,null,null,null,null,null,null,null,null,null,null,null,null,null,null,null,null,null,null,null,null,null,null,null,null,null,null,null,null,null,null,null,null,null,null,null,null,null,null,null,null,null,null,null,null,null,null,null,{"$f":"LEN(CG31)","v":12},12,12,4,13,50,21,220]
[null,null,null,null,null,null,null,null,null,null,null,null,null,null,null,null,null,null,null,null,null,null,null,null,null,null,null,null,null,null,null,null,null,null,null,null,null,null,null,null,null,null,null,null,null,null,null,null,null,null,null,null,null,null,null,null,null,null,null,null,null,null,null,null,null,null,null,null,null,null,null,null,null,null,null,null,null,null,null,null,null,null,null,null,{"$f":"LEN(CG32)","v":12},12,12,4,13,50,21,220]
[null,null,null,null,null,null,null,null,null,null,null,null,null,null,null,null,null,null,null,null,null,null,null,null,null,null,null,null,null,null,null,null,null,null,null,null,null,null,null,null,null,null,null,null,null,null,null,null,null,null,null,null,null,null,null,null,null,null,null,null,null,null,null,null,null,null,null,null,null,null,null,null,null,null,null,null,null,null,null,null,null,null,null,null,{"$f":"LEN(CG33)","v":12},12,12,4,13,50,21,220]
[null,null,null,null,null,null,null,null,null,null,null,null,null,null,null,null,null,null,null,null,null,null,null,null,null,null,null,null,null,null,null,null,null,null,null,null,null,null,null,null,null,null,null,null,null,null,null,null,null,null,null,null,null,null,null,null,null,null,null,null,null,null,null,null,null,null,null,null,null,null,null,null,null,null,null,null,null,null,null,null,null,null,null,null,{"$f":"LEN(CG34)","v":12},12,12,4,13,50,21,220]
[null,null,null,null,null,null,null,null,null,null,null,null,null,null,null,null,null,null,null,null,null,null,null,null,null,null,null,null,null,null,null,null,null,null,null,null,null,null,null,null,null,null,null,null,null,null,null,null,null,null,null,null,null,null,null,null,null,null,null,null,null,null,null,null,null,null,null,null,null,null,null,null,null,null,null,null,null,null,null,null,null,null,null,null,{"$f":"LEN(CG35)","v":12},12,12,4,13,50,21,220]
[null,null,null,null,null,null,null,null,null,null,null,null,null,null,null,null,null,null,null,null,null,null,null,null,null,null,null,null,null,null,null,null,null,null,null,null,null,null,null,null,null,null,null,null,null,null,null,null,null,null,null,null,null,null,null,null,null,null,null,null,null,null,null,null,null,null,null,null,null,null,null,null,null,null,null,null,null,null,null,null,null,null,null,null,{"$f":"LEN(CG36)","v":12},12,12,4,13,50,21,220]
[null,null,null,null,null,null,null,null,null,null,null,null,null,null,null,null,null,null,null,null,null,null,null,null,null,null,null,null,null,null,null,null,null,null,null,null,null,null,null,null,null,null,null,null,null,null,null,null,null,null,null,null,null,null,null,null,null,null,null,null,null,null,null,null,null,null,null,null,null,null,null,null,null,null,null,null,null,null,null,null,null,null,null,null,{"$f":"LEN(CG37)","v":12},12,12,4,13,50,21,220]
[null,null,null,null,null,null,null,null,null,null,null,null,null,null,null,null,null,null,null,null,null,null,null,null,null,null,null,null,null,null,null,null,null,null,null,null,null,null,null,null,null,null,null,null,null,null,null,null,null,null,null,null,null,null,null,null,null,null,null,null,null,null,null,null,null,null,null,null,null,null,null,null,null,null,null,null,null,null,null,null,null,null,null,null,{"$f":"LEN(CG38)","v":12},12,12,4,13,50,21,220]
[null,null,null,null,null,null,null,null,null,null,null,null,null,null,null,null,null,null,null,null,null,null,null,null,null,null,null,null,null,null,null,null,null,null,null,null,null,null,null,null,null,null,null,null,null,null,null,null,null,null,null,null,null,null,null,null,null,null,null,null,null,null,null,null,null,null,null,null,null,null,null,null,null,null,null,null,null,null,null,null,null,null,null,null,{"$f":"LEN(CG39)","v":12},12,12,4,13,50,21,220]
[null,null,null,null,null,null,null,null,null,null,null,null,null,null,null,null,null,null,null,null,null,null,null,null,null,null,null,null,null,null,null,null,null,null,null,null,null,null,null,null,null,null,null,null,null,null,null,null,null,null,null,null,null,null,null,null,null,null,null,null,null,null,null,null,null,null,null,null,null,null,null,null,null,null,null,null,null,null,null,null,null,null,null,null,{"$f":"LEN(CG40)","v":12},12,12,4,13,50,21,220]
[null,null,null,null,null,null,null,null,null,null,null,null,null,null,null,null,null,null,null,null,null,null,null,null,null,null,null,null,null,null,null,null,null,null,null,null,null,null,null,null,null,null,null,null,null,null,null,null,null,null,null,null,null,null,null,null,null,null,null,null,null,null,null,null,null,null,null,null,null,null,null,null,null,null,null,null,null,null,null,null,null,null,null,null,{"$f":"LEN(CG41)","v":12},12,12,4,13,50,21,220]
[null,null,null,null,null,null,null,null,null,null,null,null,null,null,null,null,null,null,null,null,null,null,null,null,null,null,null,null,null,null,null,null,null,null,null,null,null,null,null,null,null,null,null,null,null,null,null,null,null,null,null,null,null,null,null,null,null,null,null,null,null,null,null,null,null,null,null,null,null,null,null,null,null,null,null,null,null,null,null,null,null,null,null,null,{"$f":"LEN(CG42)","v":12},12,12,4,13,50,21,220]
[null,null,null,null,null,null,null,null,null,null,null,null,null,null,null,null,null,null,null,null,null,null,null,null,null,null,null,null,null,null,null,null,null,null,null,null,null,null,null,null,null,null,null,null,null,null,null,null,null,null,null,null,null,null,null,null,null,null,null,null,null,null,null,null,null,null,null,null,null,null,null,null,null,null,null,null,null,null,null,null,null,null,null,null,{"$f":"LEN(CG43)","v":12},12,12,4,13,50,21,220]
[null,null,null,null,null,null,null,null,null,null,null,null,null,null,null,null,null,null,null,null,null,null,null,null,null,null,null,null,null,null,null,null,null,null,null,null,null,null,null,null,null,null,null,null,null,null,null,null,null,null,null,null,null,null,null,null,null,null,null,null,null,null,null,null,null,null,null,null,null,null,null,null,null,null,null,null,null,null,null,null,null,null,null,null,{"$f":"LEN(CG44)","v":12},12,12,4,13,50,21,220]
[null,null,null,null,null,null,null,null,null,null,null,null,null,null,null,null,null,null,null,null,null,null,null,null,null,null,null,null,null,null,null,null,null,null,null,null,null,null,null,null,null,null,null,null,null,null,null,null,null,null,null,null,null,null,null,null,null,null,null,null,null,null,null,null,null,null,null,null,null,null,null,null,null,null,null,null,null,null,null,null,null,null,null,null,{"$f":"LEN(CG45)","v":12},12,12,4,13,50,21,220]
[null,null,null,null,null,null,null,null,null,null,null,null,null,null,null,null,null,null,null,null,null,null,null,null,null,null,null,null,null,null,null,null,null,null,null,null,null,null,null,null,null,null,null,null,null,null,null,null,null,null,null,null,null,null,null,null,null,null,null,null,null,null,null,null,null,null,null,null,null,null,null,null,null,null,null,null,null,null,null,null,null,null,null,null,{"$f":"LEN(CG46)","v":12},12,12,4,13,50,21,220]
[null,null,null,null,null,null,null,null,null,null,null,null,null,null,null,null,null,null,null,null,null,null,null,null,null,null,null,null,null,null,null,null,null,null,null,null,null,null,null,null,null,null,null,null,null,null,null,null,null,null,null,null,null,null,null,null,null,null,null,null,null,null,null,null,null,null,null,null,null,null,null,null,null,null,null,null,null,null,null,null,null,null,null,null,{"$f":"LEN(CG47)","v":12},12,12,4,13,50,21,220]
[null,null,null,null,null,null,null,null,null,null,null,null,null,null,null,null,null,null,null,null,null,null,null,null,null,null,null,null,null,null,null,null,null,null,null,null,null,null,null,null,null,null,null,null,null,null,null,null,null,null,null,null,null,null,null,null,null,null,null,null,null,null,null,null,null,null,null,null,null,null,null,null,null,null,null,null,null,null,null,null,null,null,null,null,{"$f":"LEN(CG48)","v":12},12,12,4,13,50,21,220]
[null,null,null,null,null,null,null,null,null,null,null,null,null,null,null,null,null,null,null,null,null,null,null,null,null,null,null,null,null,null,null,null,null,null,null,null,null,null,null,null,null,null,null,null,null,null,null,null,null,null,null,null,null,null,null,null,null,null,null,null,null,null,null,null,null,null,null,null,null,null,null,null,null,null,null,null,null,null,null,null,null,null,null,null,{"$f":"LEN(CG49)","v":0},2,2,1,0,0,0,0]
[null,null,null,null,null,null,null,null,null,null,null,null,null,null,null,null,null,null,null,null,null,null,null,null,null,null,null,null,null,null,null,null,null,null,null,null,null,null,null,null,null,null,null,null,null,null,null,null,null,null,null,null,null,null,null,null,null,null,null,null,null,null,null,null,null,null,null,null,null,null,null,null,null,null,null,null,null,null,null,null,null,null,null,null,{"$f":"LEN(CG50)","v":2},2,2,1,2,2,2,3]
[null,null,null,null,null,null,null,null,null,null,null,null,null,null,null,null,null,null,null,null,null,null,null,null,null,null,null,null,null,null,null,null,null,null,null,null,null,null,null,null,null,null,null,null,null,null,null,null,null,null,null,null,null,null,null,null,null,null,null,null,null,null,null,null,null,null,null,null,null,null,null,null,null,null,null,null,null,null,null,null,null,null,null,null,{"$f":"LEN(CG51)","v":2},2,2,1,2,2,2,3]
[null,null,null,null,null,null,null,null,null,null,null,null,null,null,null,null,null,null,null,null,null,null,null,null,null,null,null,null,null,null,null,null,null,null,null,null,null,null,null,null,null,null,null,null,null,null,null,null,null,null,null,null,null,null,null,null,null,null,null,null,null,null,null,null,null,null,null,null,null,null,null,null,null,null,null,null,null,null,null,null,null,null,null,null,{"$f":"LEN(CG52)","v":2},2,2,1,2,2,2,3]
[null,null,null,null,null,null,null,null,null,null,null,null,null,null,null,null,null,null,null,null,null,null,null,null,null,null,null,null,null,null,null,null,null,null,null,null,null,null,null,null,null,null,null,null,null,null,null,null,null,null,null,null,null,null,null,null,null,null,null,null,null,null,null,null,null,null,null,null,null,null,null,null,null,null,null,null,null,null,null,null,null,null,null,null,{"$f":"LEN(CG53)","v":2},2,2,1,2,2,2,3]
[null,null,null,null,null,null,null,null,null,null,null,null,null,null,null,null,null,null,null,null,null,null,null,null,null,null,null,null,null,null,null,null,null,null,null,null,null,null,null,null,null,null,null,null,null,null,null,null,null,null,null,null,null,null,null,null,null,null,null,null,null,null,null,null,null,null,null,null,null,null,null,null,null,null,null,null,null,null,null,null,null,null,null,null,{"$f":"LEN(CG54)","v":2},2,2,1,2,2,2,3]
[null,null,null,null,null,null,null,null,null,null,null,null,null,null,null,null,null,null,null,null,null,null,null,null,null,null,null,null,null,null,null,null,null,null,null,null,null,null,null,null,null,null,null,null,null,null,null,null,null,null,null,null,null,null,null,null,null,null,null,null,null,null,null,null,null,null,null,null,null,null,null,null,null,null,null,null,null,null,null,null,null,null,null,null,{"$f":"LEN(CG55)","v":2},2,2,1,2,2,2,3]
[null,null,null,null,null,null,null,null,null,null,null,null,null,null,null,null,null,null,null,null,null,null,null,null,null,null,null,null,null,null,null,null,null,null,null,null,null,null,null,null,null,null,null,null,null,null,null,null,null,null,null,null,null,null,null,null,null,null,null,null,null,null,null,null,null,null,null,null,null,null,null,null,null,null,null,null,null,null,null,null,null,null,null,null,{"$f":"LEN(CG56)","v":2},2,2,1,2,2,2,3]
[null,null,null,null,null,null,null,null,null,null,null,null,null,null,null,null,null,null,null,null,null,null,null,null,null,null,null,null,null,null,null,null,null,null,null,null,null,null,null,null,null,null,null,null,null,null,null,null,null,null,null,null,null,null,null,null,null,null,null,null,null,null,null,null,null,null,null,null,null,null,null,null,null,null,null,null,null,null,null,null,null,null,null,null,{"$f":"LEN(CG57)","v":2},2,2,1,2,2,2,3]
[null,null,null,null,null,null,null,null,null,null,null,null,null,null,null,null,null,null,null,null,null,null,null,null,null,null,null,null,null,null,null,null,null,null,null,null,null,null,null,null,null,null,null,null,null,null,null,null,null,null,null,null,null,null,null,null,null,null,null,null,null,null,null,null,null,null,null,null,null,null,null,null,null,null,null,null,null,null,null,null,null,null,null,null,{"$f":"LEN(CG58)","v":2},2,2,1,2,2,2,3]

{"sheet":"Feuil13","index":2,"n_rows":26,"n_cols":14,"rows_kept":26,"cut":false,"hidden":true,"merged":[]}
["réseau"]
["S"]
["V"]
["I "]
[]
[]
["FAC"]
["AVO"]
[]
[]
[]
[]
[]
[]
[]
[]
[]
[]
[]
[]
[]
[]
[]
[null,null,null,null,null,null,null,null,null,null,null,null,null,5.04]
[null,null,null,null,null,null,null,null,null,null,null,null,null,{"$f":"IF(RIGHT(N24,1)<5,\"oui\",\"non\")","v":"non"}]
[null,null,null,null,null,null,null,null,null,null,null,null,null,{"$f":"RIGHT(N24,1)","v":"4"}]

{"sheet":"Création CRE TI VMC","index":3,"n_rows":138,"n_cols":95,"rows_kept":138,"cut":false,"hidden":false,"merged":[]}
["CRE CONCATENE",null,null,"DONNEES PARAMETRABLES",null,null,null,null,null,null,null,null,null,null,null,null,null,"CRE DECOUPE"]
[null,null,null,null,null,null,null,null,null,null,null,null,null,null,null,null,"Début",1,3,9,11,16,21,23,26,30,32,34,35,40,45,64,72,87,103,106,107,110,111,134,137,145,165,167,170,190,202,206,207,212,217,228,230,233,239,249,252,286,289,291,307,328,352,358,364,369,385,401,402,406,414,426,438,439,444,463,471,477,502,515,528,541,542,543,546,553,558,658,670,682,694,698,711,761,782]
[null,null,null,null,null,null,null,null,null,null,null,null,null,null,null,null,"Lg",2,6,2,5,5,2,3,4,2,2,1,5,5,19,8,15,16,3,1,3,1,23,3,8,20,2,3,20,12,4,1,5,5,11,2,3,6,10,3,34,3,2,16,21,24,6,6,5,16,16,1,4,8,12,12,1,5,19,8,6,25,13,13,13,1,1,3,7,5,100,12,12,12,4,13,50,21,220]
[null,null,null,null,null,null,null,null,null,null,null,null,null,null,null,null,"Specification","« 14 »","« 000000 »","MasterCard  : \n« X0 » : Transaction initiale \n« X5 » : Impayés reçus\n« X6 » : Frais reçus\n« X7 » : Frais émis (créés par les ihm)\n« X1 » : Décisions émises\n« Y1 » : Rejet technique reçu\n« Y2 » : Rejet représenté\n\nVisa : \n« Y0 » : Transaction initiale \n« X4 » : Impayés reçus\n« X8 » : Frais reçus\n« X9 » : Frais émis (créés par les ihm)\n« X2 » : Décisions émises\n« Y3 » : Rejet technique reçu\n« Y4 » : Rejet représenté ","Code banque de domiciliation du porteur","Code banque gestionnaire du commerçant","« XA »","TRI si S04 = « 100 », « 101 », « 102 » ou « 140 » \nATI si S04 = \"400\", \"402\", \"408\"\nTRI : Transaction Initiale \nATI : Annulation de la TI ","Spaces",0,0,"1 : Porteur\n2 : Commerçant\n3 : Produit Financier ","Code établissement gestionnaire de l’acquéreur","Code guichet de l’acquéreur issu de la télécollecte","Numéro de carte porteur : si généré en 16 caractères alors paddé à droite avec les espaces \nPAN est tokénisé","Date de vente au format SSAAMMJJ","Numéro SIRET commerçant","2 décimales, pas de séparateur","Code 978 pour l'euro ","« 2 »","TI : Transaction Initiale \nIM : Impayé\nRP : représentation d'impayé ","\n« S » pour Doméstique CB","RFARNO cadré à gauche","FAC : Paiement achat\nCAS : Retrait cash\nDAB : Retrait Dab\nAVO : Avoir\nA compléter pour les AOCT","SSAAMMJJ","Localisation","Les 2 premières positions de la zone DATA-B20-DD16 du fichier CB2C en sortie","Code pays du système d’acceptation","Les 20 premières positions de la zone DATA-B17-DD18 du fichier CB2C en sortie","que pour l'impayé ","Motif de l’impayé dans la codification du format de compensation reçu.","1 : first chargeback  2 : second chargeback","Code banque issu du référentiel commerçant par rapport au SIRET","Code siège du RIB issu du référentiel commerçant par rapport au SIRET","Numéro de compte du RIB issu du référentiel commerçant par rapport au SIRET  ","Clé RIB","TRCA-NUTPTR           ","spaces","N° cotrat commerçant issu du référentiel commerçant par rapport au SIRET","espaces","espaces","978 pour euro","« 2 »","Montant compensé = Montant brut de la transaction – Commission d’Interchange","A blanc sauf pour CRE IMP","Issu du référentiel commerçant par rapport au SIRET  ","Format : JJMMAA","Donnée uniquement pour les remises commerçant ou retrait","Donnée uniquement pour les remises commerçant ou retrait","16 caractères, 2 décimales sans séparateur","16 caractères, 2 décimales sans séparateur","Code usage","« LMA » si géré dans LMA","Date de la transaction mis sous le format SSAAMMJJ","2 décimales paddés à gauche","2 décimales paddés à gauche","spaces","Code établissement gestionnaire de l’acquéreur","Numéro de carte porteur : si généré du 16 caractères, complété par des blancs","Date d’enregistrement de la transaction dans les tables au format SSAAMMJJ","Numéro attribué à l’impayé : ce numéro est crée par LMA lors de la prise en compte de l’impayé","Identifiant de remise issue de l’header CB2C (composé de 000001+DTVEN+MONEXT+5espaces)","12 caractères signés à droite, 4 décimales sans séparateur, dernier caractère signe de la commission","12 caractères signés à droite, 4 décimales sans séparateur, dernier caractère signe de la commission","12 caractères signés à droite, 4 décimales sans séparateur, dernier caractère signe de la commission","C - Usage Crédit\nD - Usage Débit\nP - Usage Prépayé\nU - Usage Universel\nb - Indéterminée (à blanc)","P - Compte Particulier\nE - Compte Entreprise\nb - Indéterminée (à blanc)","France: FRA\nUnion européenne (27 pays sans la France) ; l’évolution de cette liste doit être prévue : UE\nHors Union européenne : HUE","Contrat secondo venant du RB189 venant de la BNPP ","INC - inconnu  \nPDP - proxi avec contact \nPDPSC -  proxi sans contact\nVAD - vente à distance ","Filler","Champ 37 du CB2A fichier","Filler","Montant de la commission agent ","Filler","Filler","Filler","Filler","Filler"]
[null,null,null,null,null,null,null,null,null,null,null,null,null,null,null,null,"Libellé","Code type d’enregistrement","Numéro séquentiel","Code opération","Code banque émetteur","Code banque destinataire","Code application échange","Code sous application","Spaces","Code origine flux","Code destination flux","Code nature de flux comptable","Code établissement","Guichet accepteur","Numéro de carte","Date de vente","SIRET","Montant brut","Devise de réconciliation nationale liée au montant brut","Nombre de décimales du montant brut","Type opération","Code réseau","Référence archivage","Code opération interne","Date de règlement interbancaire","Localisation","Code département","Code pays","Raison sociale","Référence impayé reçue","Motif impayé","Code cycle impayé","Code établissement du RIB","Code Guichet du RIB ","Numéro de compte","Clé RIB","Numéro de terminal","Filler","Numéro de contrat accepteur","Code ICA","IBAN","Devise du montant compensé","nombre décimal mt compensé","Montant compensé","Référence externe","Nom du commerçant","Date de Valeur","Nombre de factures","Numéro de remise","Montant net","Montant brut en euro","Code usage","Mode de Traitement du Litige","Date envoi en compensation","Montant commission commerçant ","Montant commission Interchange CB","Type de porteur","code établissement","Numéro de carte","Date archivage","Numéro séquentiel","Identifiant de Remise","Montant commission interchange Visa/ Mastercard","Montant commission réseau Visa/ Mastercard","Montant commission banque Visa/ Mastercard","Code nature carte ","Code type carte ","Zone géographique ","Numéro de contrat secondo","Type application carte ","FILLER","Référence d'archivage Payline","FILLER","MTCOAG","FILLER","FILLER","FILLER","FILLER","FILLER"]
["Mode d'alimentation de ce fichier",null,"Généré automatiquement, à copier coller dans Notepad)","Fixe","Variable à saisir JJ/MM/AAAA","Variable liste déroulante","Variable liste déroulante","Variable à saisir 0,00","Variable à saisir 0,00","Variable à saisir 0,00","Variable à saisir 0,00","Variable à saisir 0,00","Variable à saisir 0,00","Variable liste déroulante","Variable liste déroulante","Variable liste déroulante","Mode d'alimentation de ce fichier","FIXE","FIXE","FIXE","FIXE","FIXE","FIXE","FIXE","FIXE","FIXE","FIXE","FIXE","FIXE","FIXE","FIXE","DEDUITE","DEDUITE","DEDUITE","FIXE","FIXE","FIXE","FIXE","FIXE","FIXE","DEDUITE","FIXE","FIXE","FIXE","DEDUITE","FIXE","FIXE","FIXE","FIXE","FIXE","DEDUITE","DEDUITE","FIXE","FIXE","DEDUITE","FIXE","FIXE","FIXE","FIXE","DEDUITE","FIXE","DEDUITE","DEDUITE","FIXE","FIXE","DEDUITE","DEDUITE","FIXE","FIXE","DEDUITE","DEDUITE","FIXE","FIXE","FIXE","FIXE","DEDUITE","FIXE","FIXE","DEDUITE","DEDUITE","FIXE","DEDUITE","DEDUITE","DEDUITE","FIXE","DEDUITE","FIXE","FIXE","FIXE","FIXE","FIXE","FIXE","FIXE","FIXE","FIXE"]
["CRE concerné","CRE ACTIF","CRE concaténé","Opération (CDOPEI)","Date de valeur (DTVAL)","Réseau (IDSCPT)","Commerçant","Montant Brut (MTBRUT)","Montant commission commerçant MTTTCITR","Montant Com agent ","Interchange Fee (MTINTVMC)","Scheme Fee (MTRVMC)","Montant commission banque Visa/ Mastercard MTBQVMC","Nature carte","Type carte","Zone géographique","Code","CEENR","NUSQC","CEOPE","CEEMI","CEDES","CEAPC","CEMAP","DTTRT","CECFTO","CECFTD","CDNAFL","CDETB9","CDGUICH","NUISOA","DTVEN","ZSIRET","MTBRUT","CDDEV","NBDEC","TYPOPE","IDSPCT","NUARN","CDOPEI","DTREGLI","LILOCA","CDDEPT","CDPAYS","RAISOA","NURFI2","COANO","COCYIM","CEETRX","Ceguix","NUCTEA","CLRIBX","NUTP","Filler","NUMCO","CDICA","CDIBAN","CDDEVC","NBDECC","MTCOMP","REFEXT","NMCM","DTVL","NBFCT","NUREM","MTNT (net)","MTBREUR","DSPUSG","MDTRLT","DTCOMP","MTTTCITR\n(c.commerç)","MTCOMINT\n(comm int)","TYPO","CDETB9CL","NUISOACL","DTARCHCL","NUSDICL","IDREM","MTINTVMC","MTRVMC","MTBQVMC","NATCARTE","TYPCARTE","ZONEGEO","NUMCO2","TYPAPPLI","FILLER","REFPAYLINE","FILLER","MTCOAG","PAYMETHOD","FRAISACQ","NUMCO2LONG","NEW","FILLER"]
["Enregistrement 1","oui",{"$f":"IF(B8=\"OUI\",CONCATENATE(R8,S8,T8,U8,V8,W8,X8,Y8,Z8,AA8,AB8,AC8,AD8,AE8,AF8,AG8,AH8,AI8,AJ8,AK8,AL8,AM8,AN8,AO8,AP8,AQ8,AR8,AS8,AT8,AU8,AV8,AW8,AX8,AY8,AZ8,BA8,BB8,BC8,BD8,BE8,BF8,BG8,BH8,BI8,BJ8,BK8,BL8,BM8,BN8,BO8,BP8,BQ8,BR8,BS8,BT8,BU8,BV8,BW8,BX8,BY8,BZ8,CA8,CB8,CC8,CD8,CE8,CF8,CG8,CH8,CI8,CJ8,CK8,CL8,CM8,CN8,CO8,CP8,CQ8),\"CRE NON ACTIF\")","v":"14000000Y00000030004XATRI    000021702892282513264KHYODHNJ313512025101960992700180002 00000000000050009782TI V                       FAC20251020                                                                                              9356032                                        978020000000000004990                                             201025000000     00000000000049700000000000005000     20251020000000000030             3000446432165461313564612025102000000000244400049020251020     000000010000+000000005000+000000005000+CPFRA4111182VAD                                                                                                                              000000000000                                                                   20228380131                                                                                                                                                                                                                                      "},"Payment","2025-10-20","VISA","CM_02",50,0.3,0,0.1,0.05,0.05,"Crédit","Particulier","FRA","CRE 1","14","000000",{"$f":"IF(F8=\"VISA\",\"Y0\",\"X0\")","v":"Y0"},"00000",30004,"XA","TRI","    ","00","00","2","17028","92282","513264KHYODHNJ31351",{"$f":"TEXT(E8-1,\"aaaammjj\")","v":"20251019"},{"$f":"VLOOKUP(G8,'Listes déroulantes'!G:I,3,FALSE)","v":"60992700180002 "},{"$f":"RIGHT(CONCATENATE(\"0000000000000000\",H8*100),16)","v":"0000000000005000"},"978","2","TI ",{"$f":"IF(F8=\"VISA\",\"V\",\"I\")","v":"V"},"                       ","FAC",{"$f":"TEXT(E8,\"aaaammjj\")","v":"20251020"},"                    ","  ","   ","                    ","            ","    "," ","     ","     ","           ","  ","   ","      ",{"$f":"VLOOKUP(G8,'Listes déroulantes'!G:J,4,FALSE)","v":"9356032   "},"   ","                                  ","978","02",{"$f":"RIGHT(CONCATENATE(\"0000000000000000\",(H8-K8)*100),16)","v":"0000000000004990"},"                     ","                        ",{"$f":"TEXT(E8,\"jjmmaa\")","v":"201025"},"000000","     ",{"$f":"RIGHT(CONCATENATE(\"0000000000000000\",(H8-I8)*100),16)","v":"0000000000004970"},{"$f":"RIGHT(CONCATENATE(\"0000000000000000\",H8*100),16)","v":"0000000000005000"}," ","    ",{"$f":"TEXT(E8,\"aaaammjj\")","v":"20251020"},{"$f":"RIGHT(CONCATENATE(\"0000000000000000\",(I8)*100),12)","v":"000000000030"},"            "," ",30004,"4643216546131356461",{"$f":"TEXT(E8,\"aaaammjj\")","v":"20251020"},"000000",{"$f":"CONCATENATE(\"00244400049020\",TEXT(E8,\"aammjj\"),\"     \")","v":"00244400049020251020     "},{"$f":"CONCATENATE(RIGHT(CONCATENATE(\"0000000000000000\",K8*100000),12),\"+\")","v":"000000010000+"},{"$f":"CONCATENATE(RIGHT(CONCATENATE(\"0000000000000000\",L8*100000),12),\"+\")","v":"000000005000+"},{"$f":"CONCATENATE(RIGHT(CONCATENATE(\"0000000000000000\",M8*100000),12),\"+\")","v":"000000005000+"},{"$f":"IF(N8=\"Débit\",\"D\",IF(N8=\"Crédit\",\"C\",IF(N8=\"Prépayé\",\"P\",IF(N8=\"Universelle\",\"U\",\" \"))))","v":"C"},{"$f":"IF(O8=\"Particulier\",\"P\",IF(O8=\"Entreprise\",\"E\",\" \"))","v":"P"},{"$f":"P8","v":"FRA"},{"$f":"VLOOKUP(G8,'Listes déroulantes'!G:K,5,FALSE)","v":4111182},{"$f":"VLOOKUP(G8,'Listes déroulantes'!G:L,6,FALSE)","v":"VAD  "},"                                                                                                    ","            ","            ",{"$f":"RIGHT(CONCATENATE(\"0000000000000000\",J8*100),12)","v":"000000000000"},"    ","             ","                                                  ","20228380131          ","                                                                                                                                                                                                                            "]
["Enregistrement 2","non",{"$f":"IF(B9=\"OUI\",CONCATENATE(R9,S9,T9,U9,V9,W9,X9,Y9,Z9,AA9,AB9,AC9,AD9,AE9,AF9,AG9,AH9,AI9,AJ9,AK9,AL9,AM9,AN9,AO9,AP9,AQ9,AR9,AS9,AT9,AU9,AV9,AW9,AX9,AY9,AZ9,BA9,BB9,BC9,BD9,BE9,BF9,BG9,BH9,BI9,BJ9,BK9,BL9,BM9,BN9,BO9,BP9,BQ9,BR9,BS9,BT9,BU9,BV9,BW9,BX9,BY9,BZ9,CA9,CB9,CC9,CD9,CE9,CF9,CG9,CH9,CI9,CJ9,CK9,CL9,CM9,CN9,CO9,CP9,CQ9),\"CRE NON ACTIF\")","v":"CRE NON ACTIF"},"Payment","2025-10-20","VISA","CM_02",55,0.33,0,0.11,0.06,0.06,"Débit","Particulier","UE ","CRE 2","14","000000","Y0","00000",30004,"XA","TRI","    ","00","00","2","17028","92282","513264KHYODHNJ31352","20251019",{"$f":"VLOOKUP(G9,'Listes déroulantes'!G:I,3,FALSE)","v":"60992700180002 "},"0000000000005500","978","2","TI ","V","                       ","FAC","20251020","                    ","  ","   ","                    ","            ","    "," ","     ","     ","           ","  ","   ","      ",{"$f":"VLOOKUP(G9,'Listes déroulantes'!G:J,4,FALSE)","v":"9356032   "},"   ","                                  ","978","02","0000000000005489","                     ","                        ","201025","000000","     ","0000000000005467","0000000000005500"," ","    ","20251020","000000000033","            "," ",30004,"4643216546131356461","20251020","000000","00244400049020251020     ","000000011000+","000000006000+","000000006000+",{"$f":"IF(N9=\"Débit\",\"D\",IF(N9=\"Crédit\",\"C\",IF(N9=\"Prépayé\",\"P\",IF(N9=\"Universelle\",\"U\",\" \"))))","v":"D"},{"$f":"IF(O9=\"Particulier\",\"P\",IF(O9=\"Entreprise\",\"E\",\" \"))","v":"P"},{"$f":"P9","v":"UE "},{"$f":"VLOOKUP(G9,'Listes déroulantes'!G:K,5,FALSE)","v":4111182},{"$f":"VLOOKUP(G9,'Listes déroulantes'!G:L,6,FALSE)","v":"VAD  "},"                                                                                                    ","            ","            ",{"$f":"RIGHT(CONCATENATE(\"0000000000000000\",J9*100),12)","v":"000000000000"},"    ","             ","                                                  ","20228380132          ","                                                                                                                                                                                                                            "]
["Enregistrement 3","oui","14000000X00000030004XATRI    000021702892282513264KHYODHNJ313532025101960992700180003 00000000000050009782TI I                       FAC20251020                                                                                              9356033                                        978020000000000004990                                             201025000000     00000000000049700000000000005000     20251020000000000030             3000446432165461313564612025102000000000244400049020251020     000000010000+000000005000+000000005000+DEFRA4111183PDP                                                                                                                              000000000000                                                                   20228380133                                                                                                                                                                                                                                      ","Payment","2025-10-20","MC","CM_03",50,0.3,0,0.1,0.05,0.05,"Débit","Entreprise","FRA","CRE 3","14","000000","X0","00000",30004,"XA","TRI","    ","00","00","2","17028","92282","513264KHYODHNJ31353","20251019",{"$f":"VLOOKUP(G10,'Listes déroulantes'!G:I,3,FALSE)","v":"60992700180003 "},"0000000000005000","978","2","TI ","I","                       ","FAC","20251020","                    ","  ","   ","                    ","            ","    "," ","     ","     ","           ","  ","   ","      ",{"$f":"VLOOKUP(G10,'Listes déroulantes'!G:J,4,FALSE)","v":"9356033   "},"   ","                                  ","978","02","0000000000004990","                     ","                        ","201025","000000","     ","0000000000004970","0000000000005000"," ","    ","20251020","000000000030","            "," ",30004,"4643216546131356461","20251020","000000","00244400049020251020     ","000000010000+","000000005000+","000000005000+","D","E","FRA",{"$f":"VLOOKUP(G10,'Listes déroulantes'!G:K,5,FALSE)","v":4111183},{"$f":"VLOOKUP(G10,'Listes déroulantes'!G:L,6,FALSE)","v":"PDP  "},"                                                                                                    ","            ","            ","000000000000","    ","             ","                                                  ","20228380133          ","                                                                                                                                                                                                                            "]
["Enregistrement 4","oui","14000000Y00000030004XATRI    000021702892282513264KHYODHNJ313542025101960992700180004 00000000000015239782TI V                       FAC20251020                                                                                              9356034                                        978020000000000001520                                             201025000000     00000000000015140000000000001523     20251020000000000009             3000446432165461313564612025102000000000244400049020251020     000000003000+000000002000+000000002000+UEUE 4111184VAD                                                                                                                              000000000000                                                                   20228380134                                                                                                                                                                                                                                      ","Payment","2025-10-20","VISA","CM_04",15.23,0.09,0,0.03,0.02,0.02,"Universelle","Entreprise","UE ","CRE 4","14","000000","Y0","00000",30004,"XA","TRI","    ","00","00","2","17028","92282","513264KHYODHNJ31354","20251019",{"$f":"VLOOKUP(G11,'Listes déroulantes'!G:I,3,FALSE)","v":"60992700180004 "},"0000000000001523","978","2","TI ","V","                       ","FAC","20251020","                    ","  ","   ","                    ","            ","    "," ","     ","     ","           ","  ","   ","      ",{"$f":"VLOOKUP(G11,'Listes déroulantes'!G:J,4,FALSE)","v":"9356034   "},"   ","                                  ","978","02","0000000000001520","                     ","                        ","201025","000000","     ","0000000000001514","0000000000001523"," ","    ","20251020","000000000009","            "," ",30004,"4643216546131356461","20251020","000000","00244400049020251020     ","000000003000+","000000002000+","000000002000+","U","E","UE ",{"$f":"VLOOKUP(G11,'Listes déroulantes'!G:K,5,FALSE)","v":4111184},{"$f":"VLOOKUP(G11,'Listes déroulantes'!G:L,6,FALSE)","v":"VAD  "},"                                                                                                    ","            ","            ","000000000000","    ","             ","                                                  ","20228380134          ","                                                                                                                                                                                                                            "]
["Enregistrement 5","oui","14000000Y00000030004XATRI    000021702892282513264KHYODHNJ313552025101960992700180006 00000000000022559782TI V                       FAC20251020                                                                                              9356036                                        978020000000000002250                                             201025000000     00000000000022410000000000002255     20251020000000000014             3000446432165461313564612025102000000000244400049020251020     000000005000+000000002000+000000002000+DPHUE4111186VAD                                                                                                                              000000000000                                                                   20228380135                                                                                                                                                                                                                                      ","Payment","2025-10-20","VISA","CM_06",22.55,0.14000000000000001,0,0.05,0.02,0.02,"Débit","Particulier","HUE","CRE 5","14","000000","Y0","00000",30004,"XA","TRI","    ","00","00","2","17028","92282","513264KHYODHNJ31355","20251019",{"$f":"VLOOKUP(G12,'Listes déroulantes'!G:I,3,FALSE)","v":"60992700180006 "},"0000000000002255","978","2","TI ","V","                       ","FAC","20251020","                    ","  ","   ","                    ","            ","    "," ","     ","     ","           ","  ","   ","      ",{"$f":"VLOOKUP(G12,'Listes déroulantes'!G:J,4,FALSE)","v":"9356036   "},"   ","                                  ","978","02","0000000000002250","                     ","                        ","201025","000000","     ","0000000000002241","0000000000002255"," ","    ","20251020","000000000014","            "," ",30004,"4643216546131356461","20251020","000000","00244400049020251020     ","000000005000+","000000002000+","000000002000+","D","P","HUE",{"$f":"VLOOKUP(G12,'Listes déroulantes'!G:K,5,FALSE)","v":4111186},{"$f":"VLOOKUP(G12,'Listes déroulantes'!G:L,6,FALSE)","v":"VAD  "},"                                                                                                    ","            ","            ","000000000000","    ","             ","                                                  ","20228380135          ","                                                                                                                                                                                                                            "]
["Enregistrement 6","oui","14000000Y00000030004XATRI    000021702892282513264KHYODHNJ313562025101960992700180009 00000000000052569782TI V                       FAC20251020                                                                                              9356039                                        978020000000000005245                                             201025000000     00000000000052240000000000005256     20251020000000000032             3000446432165461313564612025102000000000244400049020251020     000000011000+000000005000+000000005000+UEHUE4111189PDP                                                                                                                              000000000003                                                                   20228380136                                                                                                                                                                                                                                      ","Payment","2025-10-20","VISA","CM_09",52.56,0.32,0.03,0.11,0.05,0.05,"Universelle","Entreprise","HUE","CRE 6","14","000000","Y0","00000",30004,"XA","TRI","    ","00","00","2","17028","92282","513264KHYODHNJ31356","20251019",{"$f":"VLOOKUP(G13,'Listes déroulantes'!G:I,3,FALSE)","v":"60992700180009 "},"0000000000005256","978","2","TI ","V","                       ","FAC","20251020","                    ","  ","   ","                    ","            ","    "," ","     ","     ","           ","  ","   ","      ",{"$f":"VLOOKUP(G13,'Listes déroulantes'!G:J,4,FALSE)","v":"9356039   "},"   ","                                  ","978","02","0000000000005245","                     ","                        ","201025","000000","     ","0000000000005224","0000000000005256"," ","    ","20251020","000000000032","            "," ",30004,"4643216546131356461","20251020","000000","00244400049020251020     ","000000011000+","000000005000+","000000005000+","U","E","HUE",{"$f":"VLOOKUP(G13,'Listes déroulantes'!G:K,5,FALSE)","v":4111189},{"$f":"VLOOKUP(G13,'Listes déroulantes'!G:L,6,FALSE)","v":"PDP  "},"                                                                                                    ","            ","            ","000000000003","    ","             ","                                                  ","20228380136          ","                                                                                                                                                                                                                            "]
["Enregistrement 7","oui","14000000X00000030004XATRI    000021702892282513264KHYODHNJ313572025101960992700180010 00000000000066559782TI I                       FAC20251020                                                                                              9356040                                        978020000000000006642                                             201025000000     00000000000066150000000000006655     20251020000000000040             3000446432165461313564612025102000000000244400049020251020     000000013000+000000007000+000000007000+CPFRA4111190VAD                                                                                                                              000000000000                                                                   20228380137                                                                                                                                                                                                                                      ","Payment","2025-10-20","MC","CM_10",66.55,0.4,0,0.13,7.0000000000000007E-2,7.0000000000000007E-2,"Crédit","Particulier","FRA","CRE 7","14","000000","X0","00000",30004,"XA","TRI","    ","00","00","2","17028","92282","513264KHYODHNJ31357","20251019",{"$f":"VLOOKUP(G14,'Listes déroulantes'!G:I,3,FALSE)","v":"60992700180010 "},"0000000000006655","978","2","TI ","I","                       ","FAC","20251020","                    ","  ","   ","                    ","            ","    "," ","     ","     ","           ","  ","   ","      ",{"$f":"VLOOKUP(G14,'Listes déroulantes'!G:J,4,FALSE)","v":"9356040   "},"   ","                                  ","978","02","0000000000006642","                     ","                        ","201025","000000","     ","0000000000006615","0000000000006655"," ","    ","20251020","000000000040","            "," ",30004,"4643216546131356461","20251020","000000","00244400049020251020     ","000000013000+","000000007000+","000000007000+","C","P","FRA",{"$f":"VLOOKUP(G14,'Listes déroulantes'!G:K,5,FALSE)","v":4111190},{"$f":"VLOOKUP(G14,'Listes déroulantes'!G:L,6,FALSE)","v":"VAD  "},"                                                                                                    ","            ","            ","000000000000","    ","             ","                                                  ","20228380137          ","                                                                                                                                                                                                                            "]
["Enregistrement 8","oui","14000000Y00000030004XATRI    000021702892282513264KHYODHNJ313582025101960992700180010 00000000000118509782TI V                       FAC20251020                                                                                              9356040                                        978020000000000011826                                             201025000000     00000000000117790000000000011850     20251020000000000071             3000446432165461313564612025102000000000244400049020251020     000000024000+000000012000+000000012000+DPUE 4111190VAD                                                                                                                              000000000000                                                                   20228380138                                                                                                                                                                                                                                      ","Payment","2025-10-20","VISA","CM_10",118.5,0.71,0,0.24,0.12,0.12,"Débit","Particulier","UE ","CRE 8","14","000000","Y0","00000",30004,"XA","TRI","    ","00","00","2","17028","92282","513264KHYODHNJ31358","20251019",{"$f":"VLOOKUP(G15,'Listes déroulantes'!G:I,3,FALSE)","v":"60992700180010 "},"0000000000011850","978","2","TI ","V","                       ","FAC","20251020","                    ","  ","   ","                    ","            ","    "," ","     ","     ","           ","  ","   ","      ",{"$f":"VLOOKUP(G15,'Listes déroulantes'!G:J,4,FALSE)","v":"9356040   "},"   ","                                  ","978","02","0000000000011826","                     ","                        ","201025","000000","     ","0000000000011779","0000000000011850"," ","    ","20251020","000000000071","            "," ",30004,"4643216546131356461","20251020","000000","00244400049020251020     ","000000024000+","000000012000+","000000012000+","D","P","UE ",{"$f":"VLOOKUP(G15,'Listes déroulantes'!G:K,5,FALSE)","v":4111190},{"$f":"VLOOKUP(G15,'Listes déroulantes'!G:L,6,FALSE)","v":"VAD  "},"                                                                                                    ","            ","            ","000000000000","    ","             ","                                                  ","20228380138          ","                                                                                                                                                                                                                            "]
["Enregistrement 9","non","CRE NON ACTIF","Payment","2022-12-19","MC","CM_36_PDPAG1",25,0,0,0.05,0.03,0.03,"Débit","Entreprise","FRA","CRE 9","14","000000","X0","00000",30004,"XA","TRI","    ","00","00","2","17028","92282","513264KHYODHNJ31359","20221218",{"$f":"VLOOKUP(G16,'Listes déroulantes'!G:I,3,FALSE)","v":"60903600190001 "},"0000000000002500","978","2","TI ","I","                       ","FAC","20221219","                    ","  ","   ","                    ","            ","    "," ","     ","     ","           ","  ","   ","      ",{"$f":"VLOOKUP(G16,'Listes déroulantes'!G:J,4,FALSE)","v":"9556036   "},"   ","                                  ","978","02","0000000000002495","                     ","                        ","191222","000000","     ","0000000000002500","0000000000002500"," ","    ","20221219","000000000000","            "," ",30004,"4643216546131356461","20221219","000000","00244400049020221219     ","000000005000+","000000003000+","000000003000+","D","E","FRA",{"$f":"VLOOKUP(G16,'Listes déroulantes'!G:K,5,FALSE)","v":4102036},{"$f":"VLOOKUP(G16,'Listes déroulantes'!G:L,6,FALSE)","v":"PDP  "},"                                                                                                    ","            ","            ","000000000000","    ","             ","                                                  ","20228380139          ","                                                                                                                                                                                                                            "]
["Enregistrement 10","non","CRE NON ACTIF","Payment","2022-12-19","MC","CM_36_PDPAG1",360.03,0,0,0.72,0.36,0.36,"Universelle","Entreprise","UE ","CRE 10","14","000000","X0","00000",30004,"XA","TRI","    ","00","00","2","17028","92282","513264KHYODHNJ31360","20221218",{"$f":"VLOOKUP(G17,'Listes déroulantes'!G:I,3,FALSE)","v":"60903600190001 "},"0000000000036003","978","2","TI ","I","                       ","FAC","20221219","                    ","  ","   ","                    ","            ","    "," ","     ","     ","           ","  ","   ","      ",{"$f":"VLOOKUP(G17,'Listes déroulantes'!G:J,4,FALSE)","v":"9556036   "},"   ","                                  ","978","02","0000000000035931","                     ","                        ","191222","000000","     ","0000000000036003","0000000000036003"," ","    ","20221219","000000000000","            "," ",30004,"4643216546131356461","20221219","000000","00244400049020221219     ","000000072000+","000000036000+","000000036000+","U","E","UE ",{"$f":"VLOOKUP(G17,'Listes déroulantes'!G:K,5,FALSE)","v":4102036},{"$f":"VLOOKUP(G17,'Listes déroulantes'!G:L,6,FALSE)","v":"PDP  "},"                                                                                                    ","            ","            ","000000000000","    ","             ","                                                  ","20228380140          ","                                                                                                                                                                                                                            "]
["Enregistrement 11","non","CRE NON ACTIF","Payment","2022-12-19","MC","CM_32_VAD",50.23,0,0,0.1,0.05,0.05,"Débit","Entreprise","HUE","CRE 11","14","000000","X0","00000",30004,"XA","TRI","    ","00","00","2","17028","92282","513264KHYODHNJ31361","20221218",{"$f":"VLOOKUP(G18,'Listes déroulantes'!G:I,3,FALSE)","v":"60903200190001 "},"0000000000005023","978","2","TI ","I","                       ","FAC","20221219","                    ","  ","   ","                    ","            ","    "," ","     ","     ","           ","  ","   ","      ",{"$f":"VLOOKUP(G18,'Listes déroulantes'!G:J,4,FALSE)","v":"9556032   "},"   ","                                  ","978","02","0000000000005013","                     ","                        ","191222","000000","     ","0000000000005023","0000000000005023"," ","    ","20221219","000000000000","            "," ",30004,"4643216546131356461","20221219","000000","00244400049020221219     ","000000010000+","000000005000+","000000005000+","D","E","HUE",{"$f":"VLOOKUP(G18,'Listes déroulantes'!G:K,5,FALSE)","v":4102032},{"$f":"VLOOKUP(G18,'Listes déroulantes'!G:L,6,FALSE)","v":"VAD  "},"                                                                                                    ","            ","            ","000000000000","    ","             ","                                                  ","20228380141          ","                                                                                                                                                                                                                            "]
["Enregistrement 12","non","CRE NON ACTIF","Payment","2022-12-19","VISA","CM_34_AG1",102.56,0,0,0.21,0.1,0.1,"Débit","Entreprise","HUE","CRE 12","14","000000","Y0","00000",30004,"XA","TRI","    ","00","00","2","17028","92282","513264KHYODHNJ31362","20221218",{"$f":"VLOOKUP(G19,'Listes déroulantes'!G:I,3,FALSE)","v":"60903400190001 "},"0000000000010256","978","2","TI ","V","                       ","FAC","20221219","                    ","  ","   ","                    ","            ","    "," ","     ","     ","           ","  ","   ","      ",{"$f":"VLOOKUP(G19,'Listes déroulantes'!G:J,4,FALSE)","v":"9556034   "},"   ","                                  ","978","02","0000000000010235","                     ","                        ","191222","000000","     ","0000000000010256","0000000000010256"," ","    ","20221219","000000000000","            "," ",30004,"4643216546131356461","20221219","000000","00244400049020221219     ","000000021000+","000000010000+","000000010000+","D","E","HUE",{"$f":"VLOOKUP(G19,'Listes déroulantes'!G:K,5,FALSE)","v":4102034},{"$f":"VLOOKUP(G19,'Listes déroulantes'!G:L,6,FALSE)","v":"VAD  "},"                                                                                                    ","            ","            ","000000000000","    ","             ","                                                  ","20228380142          ","                                                                                                                                                                                                                            "]
["Enregistrement 13","non","CRE NON ACTIF","Payment","2022-12-19","VISA","CM_34_AG1",45,0,0,0.09,0.05,0.05,"Universelle","Particulier","FRA","CRE 13","14","000000","Y0","00000",30004,"XA","TRI","    ","00","00","2","17028","92282","513264KHYODHNJ31363","20221218",{"$f":"VLOOKUP(G20,'Listes déroulantes'!G:I,3,FALSE)","v":"60903400190001 "},"0000000000004500","978","2","TI ","V","                       ","FAC","20221219","                    ","  ","   ","                    ","            ","    "," ","     ","     ","           ","  ","   ","      ",{"$f":"VLOOKUP(G20,'Listes déroulantes'!G:J,4,FALSE)","v":"9556034   "},"   ","                                  ","978","02","0000000000004491","                     ","                        ","191222","000000","     ","0000000000004500","0000000000004500"," ","    ","20221219","000000000000","            "," ",30004,"4643216546131356461","20221219","000000","00244400049020221219     ","000000009000+","000000005000+","000000005000+","U","P","FRA",{"$f":"VLOOKUP(G20,'Listes déroulantes'!G:K,5,FALSE)","v":4102034},{"$f":"VLOOKUP(G20,'Listes déroulantes'!G:L,6,FALSE)","v":"VAD  "},"                                                                                                    ","            ","            ","000000000000","    ","             ","                                                  ","20228380143          ","                                                                                                                                                                                                                            "]
["Enregistrement 14","non","CRE NON ACTIF","Payment","2022-12-19","VISA","CM_34_AG1",250,1.5,0,0.5,0.25,0.25,"Débit","Entreprise","HUE","CRE 14","14","000000","Y0","00000",30004,"XA","TRI","    ","00","00","2","17028","92282","513264KHYODHNJ31364","20221218",{"$f":"VLOOKUP(G21,'Listes déroulantes'!G:I,3,FALSE)","v":"60903400190001 "},"0000000000025000","978","2","TI ","V","                       ","FAC","20221219","                    ","  ","   ","                    ","            ","    "," ","     ","     ","           ","  ","   ","      ",{"$f":"VLOOKUP(G21,'Listes déroulantes'!G:J,4,FALSE)","v":"9556034   "},"   ","                                  ","978","02","0000000000024950","                     ","                        ","191222","000000","     ","0000000000024850","0000000000025000"," ","    ","20221219","000000000150","            "," ",30004,"4643216546131356461","20221219","000000","00244400049020221219     ","000000050000+","000000025000+","000000025000+","D","E","HUE",{"$f":"VLOOKUP(G21,'Listes déroulantes'!G:K,5,FALSE)","v":4102034},{"$f":"VLOOKUP(G21,'Listes déroulantes'!G:L,6,FALSE)","v":"VAD  "},"                                                                                                    ","            ","            ","000000000000","    ","             ","                                                  ","20228380144          ","                                                                                                                                                                                                                            "]
["Enregistrement 15","non","CRE NON ACTIF","Payment","2022-12-19","MC","CM_34_AG1",77,0.46,0,0.15,0.08,0.08,"Universelle","Particulier","FRA","CRE 15","14","000000","X0","00000",30004,"XA","TRI","    ","00","00","2","17028","92282","513264KHYODHNJ31365","20221218",{"$f":"VLOOKUP(G22,'Listes déroulantes'!G:I,3,FALSE)","v":"60903400190001 "},"0000000000007700","978","2","TI ","I","                       ","FAC","20221219","                    ","  ","   ","                    ","            ","    "," ","     ","     ","           ","  ","   ","      ",{"$f":"VLOOKUP(G22,'Listes déroulantes'!G:J,4,FALSE)","v":"9556034   "},"   ","                                  ","978","02","0000000000007685","                     ","                        ","191222","000000","     ","0000000000007654","0000000000007700"," ","    ","20221219","000000000046","            "," ",30004,"4643216546131356461","20221219","000000","00244400049020221219     ","000000015000+","000000008000+","000000008000+","U","P","FRA",{"$f":"VLOOKUP(G22,'Listes déroulantes'!G:K,5,FALSE)","v":4102034},{"$f":"VLOOKUP(G22,'Listes déroulantes'!G:L,6,FALSE)","v":"VAD  "},"                                                                                                    ","            ","            ","000000000000","    ","             ","                                                  ","20228380145          ","                                                                                                                                                                                                                            "]
["Enregistrement 16","non","CRE NON ACTIF","Payment","2022-12-19","MC","CM_34_AG1",1088.8,6.53,0,2.1800000000000002,1.0900000000000001,1.0900000000000001,"Crédit","Entreprise","FRA","CRE 16","14","000000","X0","00000",30004,"XA","TRI","    ","00","00","2","17028","92282","513264KHYODHNJ31366","20221218",{"$f":"VLOOKUP(G23,'Listes déroulantes'!G:I,3,FALSE)","v":"60903400190001 "},"0000000000108880","978","2","TI ","I","                       ","FAC","20221219","                    ","  ","   ","                    ","            ","    "," ","     ","     ","           ","  ","   ","      ",{"$f":"VLOOKUP(G23,'Listes déroulantes'!G:J,4,FALSE)","v":"9556034   "},"   ","                                  ","978","02","0000000000108662","                     ","                        ","191222","000000","     ","0000000000108227","0000000000108880"," ","    ","20221219","000000000653","            "," ",30004,"4643216546131356461","20221219","000000","00244400049020221219     ","000000218000+","000000109000+","000000109000+","C","E","FRA",{"$f":"VLOOKUP(G23,'Listes déroulantes'!G:K,5,FALSE)","v":4102034},{"$f":"VLOOKUP(G23,'Listes déroulantes'!G:L,6,FALSE)","v":"VAD  "},"                                                                                                    ","            ","            ","000000000000","    ","             ","                                                  ","20228380146          ","                                                                                                                                                                                                                            "]
["Enregistrement 17","non","CRE NON ACTIF","Payment","2022-12-19","MC","CM_36_PDPAG1",20,0.12,0,0.04,0.02,0.02,"Débit","Particulier","HUE","CRE 17","14","000000","X0","00000",30004,"XA","TRI","    ","00","00","2","17028","92282","513264KHYODHNJ31367","20221218",{"$f":"VLOOKUP(G24,'Listes déroulantes'!G:I,3,FALSE)","v":"60903600190001 "},"0000000000002000","978","2","TI ","I","                       ","FAC","20221219","                    ","  ","   ","                    ","            ","    "," ","     ","     ","           ","  ","   ","      ",{"$f":"VLOOKUP(G24,'Listes déroulantes'!G:J,4,FALSE)","v":"9556036   "},"   ","                                  ","978","02","0000000000001996","                     ","                        ","191222","000000","     ","0000000000001988","0000000000002000"," ","    ","20221219","000000000012","            "," ",30004,"4643216546131356461","20221219","000000","00244400049020221219     ","000000004000+","000000002000+","000000002000+","D","P","HUE",{"$f":"VLOOKUP(G24,'Listes déroulantes'!G:K,5,FALSE)","v":4102036},{"$f":"VLOOKUP(G24,'Listes déroulantes'!G:L,6,FALSE)","v":"PDP  "},"                                                                                                    ","            ","            ","000000000000","    ","             ","                                                  ","20228380147          ","                                                                                                                                                                                                                            "]
["Enregistrement 18","non","CRE NON ACTIF","Payment","2022-12-19","MC","CM_36_PDPAG1",45.26,0.27,0,0.09,0.05,0.05,"Universelle","Entreprise","HUE","CRE 18","14","000000","X0","00000",30004,"XA","TRI","    ","00","00","2","17028","92282","513264KHYODHNJ31368","20221218",{"$f":"VLOOKUP(G25,'Listes déroulantes'!G:I,3,FALSE)","v":"60903600190001 "},"0000000000004526","978","2","TI ","I","                       ","FAC","20221219","                    ","  ","   ","                    ","            ","    "," ","     ","     ","           ","  ","   ","      ",{"$f":"VLOOKUP(G25,'Listes déroulantes'!G:J,4,FALSE)","v":"9556036   "},"   ","                                  ","978","02","0000000000004517","                     ","                        ","191222","000000","     ","0000000000004499","0000000000004526"," ","    ","20221219","000000000027","            "," ",30004,"4643216546131356461","20221219","000000","00244400049020221219     ","000000009000+","000000005000+","000000005000+","U","E","HUE",{"$f":"VLOOKUP(G25,'Listes déroulantes'!G:K,5,FALSE)","v":4102036},{"$f":"VLOOKUP(G25,'Listes déroulantes'!G:L,6,FALSE)","v":"PDP  "},"                                                                                                    ","            ","            ","000000000000","    ","             ","                                                  ","20228380148          ","                                                                                                                                                                                                                            "]
["Enregistrement 19","non","CRE NON ACTIF","Payment","2022-12-19","VISA","CM_37_VADAG1",100,2.5,0,0.5,0,0,"Crédit","Entreprise","FRA","CRE 19","14","000000","Y0","00000",30004,"XA","TRI","    ","00","00","2","17028","92282","513264KHYODHNJ31369","20221218",{"$f":"VLOOKUP(G26,'Listes déroulantes'!G:I,3,FALSE)","v":"60903700190001 "},"0000000000010000","978","2","TI ","V","                       ","FAC","20221219","                    ","  ","   ","                    ","            ","    "," ","     ","     ","           ","  ","   ","      ",{"$f":"VLOOKUP(G26,'Listes déroulantes'!G:J,4,FALSE)","v":"9556037   "},"   ","                                  ","978","02","0000000000009950","                     ","                        ","191222","000000","     ","0000000000009750","0000000000010000"," ","    ","20221219","000000000250","            "," ",30004,"4643216546131356461","20221219","000000","00244400049020221219     ","000000050000+","000000000000+","000000000000+","C","E","FRA",{"$f":"VLOOKUP(G26,'Listes déroulantes'!G:K,5,FALSE)","v":4102037},{"$f":"VLOOKUP(G26,'Listes déroulantes'!G:L,6,FALSE)","v":"VAD  "},"                                                                                                    ","            ","            ","000000000000","    ","             ","                                                  ","20228380149          ","                                                                                                                                                                                                                            "]
["Enregistrement 20","non","CRE NON ACTIF","Payment","2022-12-19","MC","CM_37_VADAG1",100,2.5,0,0.5,0,0,"Crédit","Entreprise","FRA","CRE 20","14","000000","X0","00000",30004,"XA","TRI","    ","00","00","2","17028","92282","513264KHYODHNJ31370","20221218",{"$f":"VLOOKUP(G27,'Listes déroulantes'!G:I,3,FALSE)","v":"60903700190001 "},"0000000000010000","978","2","TI ","I","                       ","FAC","20221219","                    ","  ","   ","                    ","            ","    "," ","     ","     ","           ","  ","   ","      ",{"$f":"VLOOKUP(G27,'Listes déroulantes'!G:J,4,FALSE)","v":"9556037   "},"   ","                                  ","978","02","0000000000009950","                     ","                        ","191222","000000","     ","0000000000009750","0000000000010000"," ","    ","20221219","000000000250","            "," ",30004,"4643216546131356461","20221219","000000","00244400049020221219     ","000000050000+","000000000000+","000000000000+","C","E","FRA",{"$f":"VLOOKUP(G27,'Listes déroulantes'!G:K,5,FALSE)","v":4102037},{"$f":"VLOOKUP(G27,'Listes déroulantes'!G:L,6,FALSE)","v":"VAD  "},"                                                                                                    ","            ","            ","000000000000","    ","             ","                                                  ","20228380150          ","                                                                                                                                                                                                                            "]
["Enregistrement 21","non","CRE NON ACTIF","Payment","2022-12-19","VISA","SAS MONEXT PDP",250,2.5,0,1,0.39,0.05,"Crédit","Entreprise","FRA","CRE 21","14","000000","Y0","00000",30004,"XA","TRI","    ","00","00","2","17028","92282","513264KHYODHNJ31371","20221218",{"$f":"VLOOKUP(G28,'Listes déroulantes'!G:I,3,FALSE)","v":"50318500100032 "},"0000000000025000","978","2","TI ","V","                       ","FAC","20221219","                    ","  ","   ","                    ","            ","    "," ","     ","     ","           ","  ","   ","      ",{"$f":"VLOOKUP(G28,'Listes déroulantes'!G:J,4,FALSE)","v":"9255001   "},"   ","                                  ","978","02","0000000000024900","                     ","                        ","191222","000000","     ","0000000000024750","0000000000025000"," ","    ","20221219","000000000250","            "," ",30004,"4643216546131356461","20221219","000000","00244400049020221219     ","000000100000+","000000039000+","000000005000+","C","E","FRA",{"$f":"VLOOKUP(G28,'Listes déroulantes'!G:K,5,FALSE)","v":4319211},{"$f":"VLOOKUP(G28,'Listes déroulantes'!G:L,6,FALSE)","v":"PDP  "},"                                                                                                    ","            ","            ","000000000000","    ","             ","                                                  ","20228380151          ","                                                                                                                                                                                                                            "]
["Enregistrement 22","non","CRE NON ACTIF","Refund","2022-12-19","VISA","CM_36_PDPAG1",20.5,0.12,0,0.04,0.02,0.02,"Débit","Entreprise","UE ","CRE 22","14","000000","Y0","00000",30004,"XA","TRI","    ","00","00","2","17028","92282","513264KHYODHNJ31372","20221218",{"$f":"VLOOKUP(G29,'Listes déroulantes'!G:I,3,FALSE)","v":"60903600190001 "},"0000000000002050","978","2","TI ","V","                       ","AVO","20221219","                    ","  ","   ","                    ","            ","    "," ","     ","     ","           ","  ","   ","      ",{"$f":"VLOOKUP(G29,'Listes déroulantes'!G:J,4,FALSE)","v":"9556036   "},"   ","                                  ","978","02","0000000000002046","                     ","                        ","191222","000000","     ","0000000000002038","0000000000002050"," ","    ","20221219","000000000012","            "," ",30004,"4643216546131356461","20221219","000000","00244400049020221219     ","000000004000+","000000002000+","000000002000+","D","E","UE ",{"$f":"VLOOKUP(G29,'Listes déroulantes'!G:K,5,FALSE)","v":4102036},{"$f":"VLOOKUP(G29,'Listes déroulantes'!G:L,6,FALSE)","v":"PDP  "},"                                                                                                    ","            ","            ","000000000000","    ","             ","                                                  ","20228380152          ","                                                                                                                                                                                                                            "]
["Enregistrement 23","non","CRE NON ACTIF","Refund","2022-12-19","MC","CM_36_PDPAG1",150,0.9,0,0.3,0.15,0.15,"Débit","Entreprise","UE ","CRE 23","14","000000","X0","00000",30004,"XA","TRI","    ","00","00","2","17028","92282","513264KHYODHNJ31373","20221218",{"$f":"VLOOKUP(G30,'Listes déroulantes'!G:I,3,FALSE)","v":"60903600190001 "},"0000000000015000","978","2","TI ","I","                       ","AVO","20221219","                    ","  ","   ","                    ","            ","    "," ","     ","     ","           ","  ","   ","      ",{"$f":"VLOOKUP(G30,'Listes déroulantes'!G:J,4,FALSE)","v":"9556036   "},"   ","                                  ","978","02","0000000000014970","                     ","                        ","191222","000000","     ","0000000000014910","0000000000015000"," ","    ","20221219","000000000090","            "," ",30004,"4643216546131356461","20221219","000000","00244400049020221219     ","000000030000+","000000015000+","000000015000+","D","E","UE ",{"$f":"VLOOKUP(G30,'Listes déroulantes'!G:K,5,FALSE)","v":4102036},{"$f":"VLOOKUP(G30,'Listes déroulantes'!G:L,6,FALSE)","v":"PDP  "},"                                                                                                    ","            ","            ","000000000000","    ","             ","                                                  ","20228380153          ","                                                                                                                                                                                                                            "]
["Enregistrement 24","non","CRE NON ACTIF","Refund","2022-12-19","VISA","CM_37_VADAG1",26,0.16,0,0.05,0.03,0.03,"Crédit","Entreprise","FRA","CRE 24","14","000000","Y0","00000",30004,"XA","TRI","    ","00","00","2","17028","92282","513264KHYODHNJ31374","20221218",{"$f":"VLOOKUP(G31,'Listes déroulantes'!G:I,3,FALSE)","v":"60903700190001 "},"0000000000002600","978","2","TI ","V","                       ","AVO","20221219","                    ","  ","   ","                    ","            ","    "," ","     ","     ","           ","  ","   ","      ",{"$f":"VLOOKUP(G31,'Listes déroulantes'!G:J,4,FALSE)","v":"9556037   "},"   ","                                  ","978","02","0000000000002595","                     ","                        ","191222","000000","     ","0000000000002584","0000000000002600"," ","    ","20221219","000000000016","            "," ",30004,"4643216546131356461","20221219","000000","00244400049020221219     ","000000005000+","000000003000+","000000003000+","C","E","FRA",{"$f":"VLOOKUP(G31,'Listes déroulantes'!G:K,5,FALSE)","v":4102037},{"$f":"VLOOKUP(G31,'Listes déroulantes'!G:L,6,FALSE)","v":"VAD  "},"                                                                                                    ","            ","            ","000000000000","    ","             ","                                                  ","20228380154          ","                                                                                                                                                                                                                            "]
["Enregistrement 25","non","CRE NON ACTIF","Refund","2022-12-19","VISA","CM_38_PDPAG1",252,1.51,0,0.5,0.25,0.25,"Crédit","Entreprise","FRA","CRE 25","14","000000","Y0","00000",30004,"XA","TRI","    ","00","00","2","17028","92282","513264KHYODHNJ31375","20221218",{"$f":"VLOOKUP(G32,'Listes déroulantes'!G:I,3,FALSE)","v":"60903800190001 "},"0000000000025200","978","2","TI ","V","                       ","AVO","20221219","                    ","  ","   ","                    ","            ","    "," ","     ","     ","           ","  ","   ","      ",{"$f":"VLOOKUP(G32,'Listes déroulantes'!G:J,4,FALSE)","v":"9556038   "},"   ","                                  ","978","02","0000000000025150","                     ","                        ","191222","000000","     ","0000000000025049","0000000000025200"," ","    ","20221219","000000000151","            "," ",30004,"4643216546131356461","20221219","000000","00244400049020221219     ","000000050000+","000000025000+","000000025000+","C","E","FRA",{"$f":"VLOOKUP(G32,'Listes déroulantes'!G:K,5,FALSE)","v":4102038},{"$f":"VLOOKUP(G32,'Listes déroulantes'!G:L,6,FALSE)","v":"PDP  "},"                                                                                                    ","            ","            ","000000000000","    ","             ","                                                  ","20228380155          ","                                                                                                                                                                                                                            "]
["Enregistrement 26","non","CRE NON ACTIF","Refund","2022-12-19","MC","CM_39_PDPAG2",80,0.48,0,0.16,0.08,0.08,"Universelle","Particulier","FRA","CRE 26","14","000000","X0","00000",30004,"XA","TRI","    ","00","00","2","17028","92282","513264KHYODHNJ31376","20221218",{"$f":"VLOOKUP(G33,'Listes déroulantes'!G:I,3,FALSE)","v":"60903900190001 "},"0000000000008000","978","2","TI ","I","                       ","AVO","20221219","                    ","  ","   ","                    ","            ","    "," ","     ","     ","           ","  ","   ","      ",{"$f":"VLOOKUP(G33,'Listes déroulantes'!G:J,4,FALSE)","v":"9556039   "},"   ","                                  ","978","02","0000000000007984","                     ","                        ","191222","000000","     ","0000000000007952","0000000000008000"," ","    ","20221219","000000000048","            "," ",30004,"4643216546131356461","20221219","000000","00244400049020221219     ","000000016000+","000000008000+","000000008000+","U","P","FRA",{"$f":"VLOOKUP(G33,'Listes déroulantes'!G:K,5,FALSE)","v":4102039},{"$f":"VLOOKUP(G33,'Listes déroulantes'!G:L,6,FALSE)","v":"PDP  "},"                                                                                                    ","            ","            ","000000000000","    ","             ","                                                  ","20228380156          ","                                                                                                                                                                                                                            "]
["Enregistrement 27","non","CRE NON ACTIF","Refund","2022-12-19","VISA","CM_40_VADAG2",10,0.06,0,0.02,0.01,0.01,"Débit","Entreprise","UE ","CRE 27","14","000000","Y0","00000",30004,"XA","TRI","    ","00","00","2","17028","92282","513264KHYODHNJ31377","20221218",{"$f":"VLOOKUP(G34,'Listes déroulantes'!G:I,3,FALSE)","v":"60904000190001 "},"0000000000001000","978","2","TI ","V","                       ","AVO","20221219","                    ","  ","   ","                    ","            ","    "," ","     ","     ","           ","  ","   ","      ",{"$f":"VLOOKUP(G34,'Listes déroulantes'!G:J,4,FALSE)","v":"9556040   "},"   ","                                  ","978","02","0000000000000998","                     ","                        ","191222","000000","     ","0000000000000994","0000000000001000"," ","    ","20221219","000000000006","            "," ",30004,"4643216546131356461","20221219","000000","00244400049020221219     ","000000002000+","000000001000+","000000001000+","D","E","UE ",{"$f":"VLOOKUP(G34,'Listes déroulantes'!G:K,5,FALSE)","v":4102040},{"$f":"VLOOKUP(G34,'Listes déroulantes'!G:L,6,FALSE)","v":"VAD  "},"                                                                                                    ","            ","            ","000000000000","    ","             ","                                                  ","20228380157          ","                                                                                                                                                                                                                            "]
["Enregistrement 28","non","CRE NON ACTIF","Refund","2022-12-19","MC","CM_40_VADAG2",86.23,0.52,0,0.17,0.09,0.09,"Débit","Entreprise","UE ","CRE 28","14","000000","X0","00000",30004,"XA","TRI","    ","00","00","2","17028","92282","513264KHYODHNJ31378","20221218",{"$f":"VLOOKUP(G35,'Listes déroulantes'!G:I,3,FALSE)","v":"60904000190001 "},"0000000000008623","978","2","TI ","I","                       ","AVO","20221219","                    ","  ","   ","                    ","            ","    "," ","     ","     ","           ","  ","   ","      ",{"$f":"VLOOKUP(G35,'Listes déroulantes'!G:J,4,FALSE)","v":"9556040   "},"   ","                                  ","978","02","0000000000008606","                     ","                        ","191222","000000","     ","0000000000008571","0000000000008623"," ","    ","20221219","000000000052","            "," ",30004,"4643216546131356461","20221219","000000","00244400049020221219     ","000000017000+","000000009000+","000000009000+","D","E","UE ",{"$f":"VLOOKUP(G35,'Listes déroulantes'!G:K,5,FALSE)","v":4102040},{"$f":"VLOOKUP(G35,'Listes déroulantes'!G:L,6,FALSE)","v":"VAD  "},"                                                                                                    ","            ","            ","000000000000","    ","             ","                                                  ","20228380158          ","                                                                                                                                                                                                                            "]
["Enregistrement 29","non","CRE NON ACTIF","Refund","2022-12-19","VISA","CM_32_VAD",33,0.2,0,7.0000000000000007E-2,0.03,0.03,"Débit","Entreprise","UE ","CRE 29","14","000000","Y0","00000",30004,"XA","TRI","    ","00","00","2","17028","92282","513264KHYODHNJ31379","20221218",{"$f":"VLOOKUP(G36,'Listes déroulantes'!G:I,3,FALSE)","v":"60903200190001 "},"0000000000003300","978","2","TI ","V","                       ","AVO","20221219","                    ","  ","   ","                    ","            ","    "," ","     ","     ","           ","  ","   ","      ",{"$f":"VLOOKUP(G36,'Listes déroulantes'!G:J,4,FALSE)","v":"9556032   "},"   ","                                  ","978","02","0000000000003293","                     ","                        ","191222","000000","     ","0000000000003280","0000000000003300"," ","    ","20221219","000000000020","            "," ",30004,"4643216546131356461","20221219","000000","00244400049020221219     ","000000007000+","000000003000+","000000003000+","D","E","UE ",{"$f":"VLOOKUP(G36,'Listes déroulantes'!G:K,5,FALSE)","v":4102032},{"$f":"VLOOKUP(G36,'Listes déroulantes'!G:L,6,FALSE)","v":"VAD  "},"                                                                                                    ","            ","            ","000000000000","    ","             ","                                                  ","20228380159          ","                                                                                                                                                                                                                            "]
["Enregistrement 30","non","CRE NON ACTIF","Refund","2022-12-19","MC","CM_32_VAD",25.23,0.15,0,0.05,0.03,0.03,"Débit","Entreprise","FRA","CRE 30","14","000000","X0","00000",30004,"XA","TRI","    ","00","00","2","17028","92282","513264KHYODHNJ31380","20221218",{"$f":"VLOOKUP(G37,'Listes déroulantes'!G:I,3,FALSE)","v":"60903200190001 "},"0000000000002523","978","2","TI ","I","                       ","AVO","20221219","                    ","  ","   ","                    ","            ","    "," ","     ","     ","           ","  ","   ","      ",{"$f":"VLOOKUP(G37,'Listes déroulantes'!G:J,4,FALSE)","v":"9556032   "},"   ","                                  ","978","02","0000000000002518","                     ","                        ","191222","000000","     ","0000000000002508","0000000000002523"," ","    ","20221219","000000000015","            "," ",30004,"4643216546131356461","20221219","000000","00244400049020221219     ","000000005000+","000000003000+","000000003000+","D","E","FRA",{"$f":"VLOOKUP(G37,'Listes déroulantes'!G:K,5,FALSE)","v":4102032},{"$f":"VLOOKUP(G37,'Listes déroulantes'!G:L,6,FALSE)","v":"VAD  "},"                                                                                                    ","            ","            ","000000000000","    ","             ","                                                  ","20228380160          ","                                                                                                                                                                                                                            "]
["Enregistrement 31","oui","14000000X00000030004XATRI    000021702892282513264KHYODHNJ313812025101960992700180010 00000000000300229782TI I                       AVO20251020                                                                                              9356040                                        978020000000000029962                                             201025000000     00000000000298420000000000030022     20251020000000000180             3000446432165461313564612025102000000000244400049020251020     000000060000+000000030000+000000030000+CEFRA4111190VAD                                                                                                                              000000000000                                                                   20228380161                                                                                                                                                                                                                                      ","Refund","2025-10-20","MC","CM_10",300.22000000000003,1.8,0,0.6,0.3,0.3,"Crédit","Entreprise","FRA","CRE 31","14","000000","X0","00000",30004,"XA","TRI","    ","00","00","2","17028","92282","513264KHYODHNJ31381","20251019",{"$f":"VLOOKUP(G38,'Listes déroulantes'!G:I,3,FALSE)","v":"60992700180010 "},"0000000000030022","978","2","TI ","I","                       ","AVO","20251020","                    ","  ","   ","                    ","            ","    "," ","     ","     ","           ","  ","   ","      ",{"$f":"VLOOKUP(G38,'Listes déroulantes'!G:J,4,FALSE)","v":"9356040   "},"   ","                                  ","978","02","0000000000029962","                     ","                        ","201025","000000","     ","0000000000029842","0000000000030022"," ","    ","20251020","000000000180","            "," ",30004,"4643216546131356461","20251020","000000","00244400049020251020     ","000000060000+","000000030000+","000000030000+","C","E","FRA",{"$f":"VLOOKUP(G38,'Listes déroulantes'!G:K,5,FALSE)","v":4111190},{"$f":"VLOOKUP(G38,'Listes déroulantes'!G:L,6,FALSE)","v":"VAD  "},"                                                                                                    ","            ","            ","000000000000","    ","             ","                                                  ","20228380161          ","                                                                                                                                                                                                                            "]
["Enregistrement 32","oui","14000000Y00000030004XATRI    000021702892282513264KHYODHNJ313822025101960992700180010 00000000000002339782TI V                       AVO20251020                                                                                              9356040                                        978020000000000000233                                             201025000000     00000000000002320000000000000233     20251020000000000001             3000446432165461313564612025102000000000244400049020251020     000000000000+000000000000+000000000000+CEFRA4111190VAD                                                                                                                              000000000000                                                                   20228380162                                                                                                                                                                                                                                      ","Refund","2025-10-20","VISA","CM_10",2.33,0.01,0,0,0,0,"Crédit","Entreprise","FRA","CRE 32","14","000000","Y0","00000",30004,"XA","TRI","    ","00","00","2","17028","92282","513264KHYODHNJ31382","20251019",{"$f":"VLOOKUP(G39,'Listes déroulantes'!G:I,3,FALSE)","v":"60992700180010 "},"0000000000000233","978","2","TI ","V","                       ","AVO","20251020","                    ","  ","   ","                    ","            ","    "," ","     ","     ","           ","  ","   ","      ",{"$f":"VLOOKUP(G39,'Listes déroulantes'!G:J,4,FALSE)","v":"9356040   "},"   ","                                  ","978","02","0000000000000233","                     ","                        ","201025","000000","     ","0000000000000232","0000000000000233"," ","    ","20251020","000000000001","            "," ",30004,"4643216546131356461","20251020","000000","00244400049020251020     ","000000000000+","000000000000+","000000000000+","C","E","FRA",{"$f":"VLOOKUP(G39,'Listes déroulantes'!G:K,5,FALSE)","v":4111190},{"$f":"VLOOKUP(G39,'Listes déroulantes'!G:L,6,FALSE)","v":"VAD  "},"                                                                                                    ","            ","            ","000000000000","    ","             ","                                                  ","20228380162          ","                                                                                                                                                                                                                            "]
["Enregistrement 33","oui","14000000Y00000030004XATRI    000021702892282513264KHYODHNJ313832025101960992700180002 00000000000055009782TI V                       AVO20251020                                                                                              9356032                                        978020000000000005489                                             201025000000     00000000000054670000000000005500     20251020000000000033             3000446432165461313564612025102000000000244400049020251020     000000011000+000000006000+000000006000+CEFRA4111182VAD                                                                                                                              000000000000                                                                   20228380163                                                                                                                                                                                                                                      ","Refund","2025-10-20","VISA","CM_02",55,0.33,0,0.11,0.06,0.06,"Crédit","Entreprise","FRA","CRE 33","14","000000","Y0","00000",30004,"XA","TRI","    ","00","00","2","17028","92282","513264KHYODHNJ31383","20251019",{"$f":"VLOOKUP(G40,'Listes déroulantes'!G:I,3,FALSE)","v":"60992700180002 "},"0000000000005500","978","2","TI ","V","                       ","AVO","20251020","                    ","  ","   ","                    ","            ","    "," ","     ","     ","           ","  ","   ","      ",{"$f":"VLOOKUP(G40,'Listes déroulantes'!G:J,4,FALSE)","v":"9356032   "},"   ","                                  ","978","02","0000000000005489","                     ","                        ","201025","000000","     ","0000000000005467","0000000000005500"," ","    ","20251020","000000000033","            "," ",30004,"4643216546131356461","20251020","000000","00244400049020251020     ","000000011000+","000000006000+","000000006000+","C","E","FRA",{"$f":"VLOOKUP(G40,'Listes déroulantes'!G:K,5,FALSE)","v":4111182},{"$f":"VLOOKUP(G40,'Listes déroulantes'!G:L,6,FALSE)","v":"VAD  "},"                                                                                                    ","            ","            ","000000000000","    ","             ","                                                  ","20228380163          ","                                                                                                                                                                                                                            "]
["Enregistrement 34","non","CRE NON ACTIF","Refund","2022-12-19","VISA","CM_36_PDPAG1",45.25,0,0,0.09,0.05,0.05,"Crédit","Entreprise","FRA","CRE 34","14","000000","Y0","00000",30004,"XA","TRI","    ","00","00","2","17028","92282","513264KHYODHNJ31384","20221218",{"$f":"VLOOKUP(G41,'Listes déroulantes'!G:I,3,FALSE)","v":"60903600190001 "},"0000000000004525","978","2","TI ","V","                       ","AVO","20221219","                    ","  ","   ","                    ","            ","    "," ","     ","     ","           ","  ","   ","      ",{"$f":"VLOOKUP(G41,'Listes déroulantes'!G:J,4,FALSE)","v":"9556036   "},"   ","                                  ","978","02","0000000000004516","                     ","                        ","191222","000000","     ","0000000000004525","0000000000004525"," ","    ","20221219","000000000000","            "," ",30004,"4643216546131356461","20221219","000000","00244400049020221219     ","000000009000+","000000005000+","000000005000+","C","E","FRA",{"$f":"VLOOKUP(G41,'Listes déroulantes'!G:K,5,FALSE)","v":4102036},{"$f":"VLOOKUP(G41,'Listes déroulantes'!G:L,6,FALSE)","v":"PDP  "},"                                                                                                    ","            ","            ","000000000000","    ","             ","                                                  ","20228380164          ","                                                                                                                                                                                                                            "]
["Enregistrement 35","non","CRE NON ACTIF","Refund","2022-12-19","MC","CM_36_PDPAG1",152.56,0,0,0.31,0.15,0.15,"Crédit","Entreprise","FRA","CRE 35","14","000000","X0","00000",30004,"XA","TRI","    ","00","00","2","17028","92282","513264KHYODHNJ31385","20221218",{"$f":"VLOOKUP(G42,'Listes déroulantes'!G:I,3,FALSE)","v":"60903600190001 "},"0000000000015256","978","2","TI ","I","                       ","AVO","20221219","                    ","  ","   ","                    ","            ","    "," ","     ","     ","           ","  ","   ","      ",{"$f":"VLOOKUP(G42,'Listes déroulantes'!G:J,4,FALSE)","v":"9556036   "},"   ","                                  ","978","02","0000000000015225","                     ","                        ","191222","000000","     ","0000000000015256","0000000000015256"," ","    ","20221219","000000000000","            "," ",30004,"4643216546131356461","20221219","000000","00244400049020221219     ","000000031000+","000000015000+","000000015000+","C","E","FRA",{"$f":"VLOOKUP(G42,'Listes déroulantes'!G:K,5,FALSE)","v":4102036},{"$f":"VLOOKUP(G42,'Listes déroulantes'!G:L,6,FALSE)","v":"PDP  "},"                                                                                                    ","            ","            ","000000000000","    ","             ","                                                  ","20228380165          ","                                                                                                                                                                                                                            "]
["Enregistrement 36","non","CRE NON ACTIF","Refund","2022-12-19","VISA","CM_37_VADAG1",54,0.32,0,0.11,0.05,0.05,"Crédit","Entreprise","FRA","CRE 36","14","000000","Y0","00000",30004,"XA","TRI","    ","00","00","2","17028","92282","513264KHYODHNJ31386","20221218",{"$f":"VLOOKUP(G43,'Listes déroulantes'!G:I,3,FALSE)","v":"60903700190001 "},"0000000000005400","978","2","TI ","V","                       ","AVO","20221219","                    ","  ","   ","                    ","            ","    "," ","     ","     ","           ","  ","   ","      ",{"$f":"VLOOKUP(G43,'Listes déroulantes'!G:J,4,FALSE)","v":"9556037   "},"   ","                                  ","978","02","0000000000005389","                     ","                        ","191222","000000","     ","0000000000005368","0000000000005400"," ","    ","20221219","000000000032","            "," ",30004,"4643216546131356461","20221219","000000","00244400049020221219     ","000000011000+","000000005000+","000000005000+","C","E","FRA",{"$f":"VLOOKUP(G43,'Listes déroulantes'!G:K,5,FALSE)","v":4102037},{"$f":"VLOOKUP(G43,'Listes déroulantes'!G:L,6,FALSE)","v":"VAD  "},"                                                                                                    ","            ","            ","000000000000","    ","             ","                                                  ","20228380166          ","                                                                                                                                                                                                                            "]
["Enregistrement 37","non","CRE NON ACTIF","Refund","2022-12-19","MC","CM_37_VADAG1",17,0,0,1,0.39,0,"Crédit","Entreprise","FRA","CRE 37","14","000000","X0","00000",30004,"XA","TRI","    ","00","00","2","17028","92282","513264KHYODHNJ31387","20221218",{"$f":"VLOOKUP(G44,'Listes déroulantes'!G:I,3,FALSE)","v":"60903700190001 "},"0000000000001700","978","2","TI ","I","                       ","AVO","20221219","                    ","  ","   ","                    ","            ","    "," ","     ","     ","           ","  ","   ","      ",{"$f":"VLOOKUP(G44,'Listes déroulantes'!G:J,4,FALSE)","v":"9556037   "},"   ","                                  ","978","02","0000000000001600","                     ","                        ","191222","000000","     ","0000000000001700","0000000000001700"," ","    ","20221219","000000000000","            "," ",30004,"4643216546131356461","20221219","000000","00244400049020221219     ","000000100000+","000000039000+","000000000000+","C","E","FRA",{"$f":"VLOOKUP(G44,'Listes déroulantes'!G:K,5,FALSE)","v":4102037},{"$f":"VLOOKUP(G44,'Listes déroulantes'!G:L,6,FALSE)","v":"VAD  "},"                                                                                                    ","            ","            ","000000000000","    ","             ","                                                  ","20228380167          ","                                                                                                                                                                                                                            "]
["Enregistrement 38","non","CRE NON ACTIF","Refund","2022-12-19","VISA","GUY DEMARLE VAD",18,0,0,1,0.39,0,"Crédit","Entreprise","FRA","CRE 38","14","000000","Y0","00000",30004,"XA","TRI","    ","00","00","2","17028","92282","513264KHYODHNJ31388","20221218",{"$f":"VLOOKUP(G45,'Listes déroulantes'!G:I,3,FALSE)","v":"49769047900025 "},"0000000000001800","978","2","TI ","V","                       ","AVO","20221219","                    ","  ","   ","                    ","            ","    "," ","     ","     ","           ","  ","   ","      ",{"$f":"VLOOKUP(G45,'Listes déroulantes'!G:J,4,FALSE)","v":"9255005   "},"   ","                                  ","978","02","0000000000001700","                     ","                        ","191222","000000","     ","0000000000001800","0000000000001800"," ","    ","20221219","000000000000","            "," ",30004,"4643216546131356461","20221219","000000","00244400049020221219     ","000000100000+","000000039000+","000000000000+","C","E","FRA",{"$f":"VLOOKUP(G45,'Listes déroulantes'!G:K,5,FALSE)","v":4319669},{"$f":"VLOOKUP(G45,'Listes déroulantes'!G:L,6,FALSE)","v":"VAD  "},"                                                                                                    ","            ","            ","000000000000","    ","             ","                                                  ","20228380168          ","                                                                                                                                                                                                                            "]
["Enregistrement 39","non","CRE NON ACTIF","Refund","2022-12-19","VISA","SAS MONEXT PDP",19,0,0,1,0.39,0,"Crédit","Entreprise","FRA","CRE 39","14","000000","Y0","00000",30004,"XA","TRI","    ","00","00","2","17028","92282","513264KHYODHNJ31389","20221218",{"$f":"VLOOKUP(G46,'Listes déroulantes'!G:I,3,FALSE)","v":"50318500100032 "},"0000000000001900","978","2","TI ","V","                       ","AVO","20221219","                    ","  ","   ","                    ","            ","    "," ","     ","     ","           ","  ","   ","      ",{"$f":"VLOOKUP(G46,'Listes déroulantes'!G:J,4,FALSE)","v":"9255001   "},"   ","                                  ","978","02","0000000000001800","                     ","                        ","191222","000000","     ","0000000000001900","0000000000001900"," ","    ","20221219","000000000000","            "," ",30004,"4643216546131356461","20221219","000000","00244400049020221219     ","000000100000+","000000039000+","000000000000+","C","E","FRA",{"$f":"VLOOKUP(G46,'Listes déroulantes'!G:K,5,FALSE)","v":4319211},{"$f":"VLOOKUP(G46,'Listes déroulantes'!G:L,6,FALSE)","v":"PDP  "},"                                                                                                    ","            ","            ","000000000000","    ","             ","                                                  ","20228380169          ","                                                                                                                                                                                                                            "]
["Enregistrement 40","non","CRE NON ACTIF","Refund","2022-12-19","VISA","SAS MONEXT PDP",269,0,0,1,0.39,0,"Crédit","Entreprise","FRA","CRE 40","14","000000","Y0","00000",30004,"XA","TRI","    ","00","00","2","17028","92282","513264KHYODHNJ31390","20221218",{"$f":"VLOOKUP(G47,'Listes déroulantes'!G:I,3,FALSE)","v":"50318500100032 "},"0000000000026900","978","2","TI ","V","                       ","AVO","20221219","                    ","  ","   ","                    ","            ","    "," ","     ","     ","           ","  ","   ","      ",{"$f":"VLOOKUP(G47,'Listes déroulantes'!G:J,4,FALSE)","v":"9255001   "},"   ","                                  ","978","02","0000000000026800","                     ","                        ","191222","000000","     ","0000000000026900","0000000000026900"," ","    ","20221219","000000000000","            "," ",30004,"4643216546131356461","20221219","000000","00244400049020221219     ","000000100000+","000000039000+","000000000000+","C","E","FRA",{"$f":"VLOOKUP(G47,'Listes déroulantes'!G:K,5,FALSE)","v":4319211},{"$f":"VLOOKUP(G47,'Listes déroulantes'!G:L,6,FALSE)","v":"PDP  "},"                                                                                                    ","            ","            ","000000000000","    ","             ","                                                  ","20228380170          ","                                                                                                                                                                                                                            "]
["Enregistrement 41","non","CRE NON ACTIF","Refund","2022-12-19","VISA","SAS MONEXT PDP",270,0,0,1,0.39,0,"Crédit","Entreprise","FRA","CRE 41","14","000000","Y0","00000",30004,"XA","TRI","    ","00","00","2","17028","92282","513264KHYODHNJ31391","20221218",{"$f":"VLOOKUP(G48,'Listes déroulantes'!G:I,3,FALSE)","v":"50318500100032 "},"0000000000027000","978","2","TI ","V","                       ","AVO","20221219","                    ","  ","   ","                    ","            ","    "," ","     ","     ","           ","  ","   ","      ",{"$f":"VLOOKUP(G48,'Listes déroulantes'!G:J,4,FALSE)","v":"9255001   "},"   ","                                  ","978","02","0000000000026900","                     ","                        ","191222","000000","     ","0000000000027000","0000000000027000"," ","    ","20221219","000000000000","            "," ",30004,"4643216546131356461","20221219","000000","00244400049020221219     ","000000100000+","000000039000+","000000000000+","C","E","FRA",{"$f":"VLOOKUP(G48,'Listes déroulantes'!G:K,5,FALSE)","v":4319211},{"$f":"VLOOKUP(G48,'Listes déroulantes'!G:L,6,FALSE)","v":"PDP  "},"                                                                                                    ","            ","            ","000000000000","    ","             ","                                                  ","20228380171          ","                                                                                                                                                                                                                            "]
[null,null,null,null,null,null,null,null,null,null,null,null,null,null,null,null,null,null,null,null,null,null,null,null,null,null,null,null,null,null,null,null,null,null,null,null,null,null,{"$f":"LEN(AM8)","v":23},null,null,null,null,null,null,null,null,null,null,null,null,null,null,null,null,null,null,null,null,null,null,{"$f":"LEN(BJ47)","v":24},null,null,null,null,null,null,null,null,null,null,null,null,null,null,null,null,null,null,null,null,null,null,null,null,{"$f":"LEN(CI8)","v":100},{"$f":"LEN(CJ8)","v":12},{"$f":"LEN(CK8)","v":12}]
[null,null,null,null,null,null,null,null,null,null,null,null,null,null,null,null,null,null,null,null,null,null,null,null,null,null,null,null,null,null,null,null,null,null,null,null,null,null,{"$f":"LEN(AM9)","v":23},null,null,null,null,null,null,null,null,null,null,null,null,null,null,null,null,null,null,null,null,null,null,null,null,null,null,null,null,null,null,null,null,null,null,null,null,null,null,null,null,null,null,null,null,null,null,null,{"$f":"LEN(CI9)","v":100},12,12]
[null,null,null,null,null,null,null,null,null,null,null,null,null,null,null,null,null,null,null,null,null,null,null,null,null,null,null,null,null,null,null,null,null,null,null,null,null,null,23,null,null,null,null,null,null,null,null,null,null,null,null,null,null,null,null,null,null,null,null,null,null,null,null,null,null,null,null,null,null,null,null,null,null,null,null,null,null,null,null,null,null,null,null,null,null,null,100,12,12]
[null,null,null,null,null,null,null,null,null,null,null,null,null,null,null,null,null,null,null,null,null,null,null,null,null,null,null,null,null,null,null,null,null,null,null,null,null,null,23,null,null,null,null,null,null,null,null,null,null,null,null,null,null,null,null,null,null,null,null,null,null,null,null,null,null,null,null,null,null,null,null,null,null,null,null,null,null,{"$f":"LEN(BZ8)","v":25},null,null,null,null,null,null,null,null,100,12,12]
[null,null,null,null,null,null,null,null,null,null,null,null,null,null,null,null,null,null,null,null,null,null,null,null,null,null,null,null,null,null,null,null,null,null,null,null,null,null,23,null,null,null,null,null,null,null,null,null,null,null,null,null,null,null,null,null,null,null,null,null,null,null,null,null,null,null,null,null,null,null,null,null,null,null,null,null,null,null,null,null,null,null,null,null,null,null,100,12,12]
[null,null,null,null,null,null,null,null,null,null,null,null,null,null,null,null,null,null,null,null,null,null,null,null,null,null,null,null,null,null,null,null,null,null,null,null,null,null,23,null,null,null,null,null,null,null,null,null,null,null,null,null,null,null,null,null,null,null,null,null,null,null,null,null,null,null,null,null,null,null,null,null,null,null,null,null,null,null,null,null,null,null,null,null,null,null,100,12,12]
[null,null,null,null,null,null,null,null,null,null,null,null,null,null,null,null,null,null,null,null,null,null,null,null,null,null,null,null,null,null,null,null,null,null,null,null,null,null,23,null,null,null,null,null,null,null,null,null,null,null,null,null,null,null,null,null,null,null,null,null,null,null,null,null,null,null,null,null,null,null,null,null,null,null,null,null,null,null,null,null,null,null,null,null,null,null,100,12,12]
[null,null,null,null,null,null,null,null,null,null,null,null,null,null,null,null,null,null,null,null,null,null,null,null,null,null,null,null,null,null,null,null,null,null,null,null,null,null,23,null,null,null,null,null,null,null,null,null,null,null,null,null,null,null,null,null,null,null,null,null,null,null,null,null,null,null,null,null,null,null,null,null,null,null,null,null,null,null,null,null,null,null,null,null,null,null,100,12,12]
[null,null,null,null,null,null,null,null,null,null,null,null,null,null,null,null,null,null,null,null,null,null,null,null,null,null,null,null,null,null,null,null,null,null,null,null,null,null,null,null,null,null,null,null,null,null,null,null,null,null,null,null,null,null,null,null,null,null,null,null,null,null,null,null,null,null,null,null,null,null,null,null,null,null,null,null,null,null,null,null,null,null,null,null,null,null,100,12,12]
[null,null,null,null,null,null,null,null,null,null,null,null,null,null,null,null,null,null,null,null,null,null,null,null,null,null,null,null,null,null,null,null,null,null,null,null,null,null,null,null,null,null,null,null,null,null,null,null,null,null,null,null,null,null,null,null,null,null,null,null,null,null,null,null,null,null,null,null,null,null,null,null,null,null,null,null,null,null,null,null,null,null,null,null,null,null,100,12,12]
[null,null,null,null,null,null,null,null,null,null,null,null,null,null,null,null,null,null,null,null,null,null,null,null,null,null,null,null,null,null,null,null,null,null,null,null,null,null,null,null,null,null,null,null,null,null,null,null,null,null,null,null,null,null,null,null,null,null,null,null,null,null,null,null,null,null,null,null,null,null,null,null,null,null,null,null,null,null,null,null,null,null,null,null,null,null,100,12,12]
[null,null,null,null,null,null,null,null,null,null,null,null,null,null,null,null,null,null,null,null,null,null,null,null,null,null,null,null,null,null,null,null,null,null,null,null,null,null,null,null,null,null,null,null,null,null,null,null,null,null,null,null,null,null,null,null,null,null,null,null,null,null,null,null,null,null,null,null,null,null,null,null,null,null,null,null,null,null,null,null,null,null,null,null,null,null,100,12,12]
[null,null,null,null,null,null,null,null,null,null,null,null,null,null,null,null,null,null,null,null,null,null,null,null,null,null,null,null,null,null,null,null,null,null,null,null,null,null,null,null,null,null,null,null,null,null,null,null,null,null,null,null,null,null,null,null,null,null,null,null,null,null,null,null,null,null,null,null,null,null,null,null,null,null,null,null,null,null,null,null,null,null,null,null,null,null,100,12,12]
[null,null,null,null,null,null,null,null,null,null,null,null,null,null,null,null,null,null,null,null,null,null,null,null,null,null,null,null,null,null,null,null,null,null,null,null,null,null,null,null,null,null,null,null,null,null,null,null,null,null,null,null,null,null,null,null,null,null,null,null,null,null,null,null,null,null,null,null,null,null,null,null,null,null,null,null,null,null,null,null,null,null,null,null,null,null,100,12,12]
[null,null,null,null,null,null,null,null,null,null,null,null,null,null,null,null,null,null,null,null,null,null,null,null,null,null,null,null,null,null,null,null,null,null,null,null,null,null,null,null,null,null,null,null,null,null,null,null,null,null,null,null,null,null,null,null,null,null,null,null,null,null,null,null,null,null,null,null,null,null,null,null,null,null,null,null,null,null,null,null,null,null,null,null,null,null,100,12,12]
[null,null,null,null,null,null,null,null,null,null,null,null,null,null,null,null,null,null,null,null,null,null,null,null,null,null,null,null,null,null,null,null,null,null,null,null,null,null,null,null,null,null,null,null,null,null,null,null,null,null,null,null,null,null,null,null,null,null,null,null,null,null,null,null,null,null,null,null,null,null,null,null,null,null,null,null,null,null,null,null,null,null,null,null,null,null,100,12,12]
[null,null,null,null,null,null,null,null,null,null,null,null,null,null,null,null,null,null,null,null,null,null,null,null,null,null,null,null,null,null,null,null,null,null,null,null,null,null,null,null,null,null,null,null,null,null,null,null,null,null,null,null,null,null,null,null,null,null,null,null,null,null,null,null,null,null,null,null,null,null,null,null,null,null,null,null,null,null,null,null,null,null,null,null,null,null,100,12,12]
[null,null,null,null,null,null,null,null,null,null,null,null,null,null,null,null,null,null,null,null,null,null,null,null,null,null,null,null,null,null,null,null,null,null,null,null,null,null,null,null,null,null,null,null,null,null,null,null,null,null,null,null,null,null,null,null,null,null,null,null,null,null,null,null,null,null,null,null,null,null,null,null,null,null,null,null,null,null,null,null,null,null,null,null,null,null,{"$f":"LEN(CI25)","v":100},12,12]
[null,null,null,null,null,null,null,null,null,null,null,null,null,null,null,null,null,null,null,null,null,null,null,null,null,null,null,null,null,null,null,null,null,null,null,null,null,null,null,null,null,null,null,null,null,null,null,null,null,null,null,null,null,null,null,null,null,null,null,null,null,null,null,null,null,null,null,null,null,null,null,null,null,null,null,null,null,null,null,null,null,null,null,null,null,null,100,12,12]
[null,null,null,null,null,null,null,null,null,null,null,null,null,null,null,null,null,null,null,null,null,null,null,null,null,null,null,null,null,null,null,null,null,null,null,null,null,null,null,null,null,null,null,null,null,null,null,null,null,null,null,null,null,null,null,null,null,null,null,null,null,null,null,null,null,null,null,null,null,null,null,null,null,null,null,null,null,null,null,null,null,null,null,null,null,null,100,12,12]
[null,null,null,null,null,null,null,null,null,null,null,null,null,null,null,null,null,null,null,null,null,null,null,null,null,null,null,null,null,null,null,null,null,null,null,null,null,null,null,null,null,null,null,null,null,null,null,null,null,null,null,null,null,null,null,null,null,null,null,null,null,null,null,null,null,null,null,null,null,null,null,null,null,null,null,null,null,null,null,null,null,null,null,null,null,null,100,12,12]
[null,null,null,null,null,null,null,null,null,null,null,null,null,null,null,null,null,null,null,null,null,null,null,null,null,null,null,null,null,null,null,null,null,null,null,null,null,null,null,null,null,null,null,null,null,null,null,null,null,null,null,null,null,null,null,null,null,null,null,null,null,null,null,null,null,null,null,null,null,null,null,null,null,null,null,null,null,null,null,null,null,null,null,null,null,null,100,12,12]
[null,null,null,null,null,null,null,null,null,null,null,null,null,null,null,null,null,null,null,null,null,null,null,null,null,null,null,null,null,null,null,null,null,null,null,null,null,null,null,null,null,null,null,null,null,null,null,null,null,null,null,null,null,null,null,null,null,null,null,null,null,null,null,null,null,null,null,null,null,null,null,null,null,null,null,null,null,null,null,null,null,null,null,null,null,null,100,12,12]
[null,null,null,null,null,null,null,null,null,null,null,null,null,null,null,null,null,null,null,null,null,null,null,null,null,null,null,null,null,null,null,null,null,null,null,null,null,null,null,null,null,null,null,null,null,null,null,null,null,null,null,null,null,null,null,null,null,null,null,null,null,null,null,null,null,null,null,null,null,null,null,null,null,null,null,null,null,null,null,null,null,null,null,null,null,null,100,12,12]
[null,null,null,null,null,null,null,null,null,null,null,null,null,null,null,null,null,null,null,null,null,null,null,null,null,null,null,null,null,null,null,null,null,null,null,null,null,null,null,null,null,null,null,null,null,null,null,null,null,null,null,null,null,null,null,null,null,null,null,null,null,null,null,null,null,null,null,null,null,null,null,null,null,null,null,null,null,null,null,null,null,null,null,null,null,null,100,12,12]
[null,null,null,null,null,null,null,null,null,null,null,null,null,null,null,null,null,null,null,null,null,null,null,null,null,null,null,null,null,null,null,null,null,null,null,null,null,null,null,null,null,null,null,null,null,null,null,null,null,null,null,null,null,null,null,null,null,null,null,null,null,null,null,null,null,null,null,null,null,null,null,null,null,null,null,null,null,null,null,null,null,null,null,null,null,null,100,12,12]
[null,null,null,null,null,null,null,null,null,null,null,null,null,null,null,null,null,null,null,null,null,null,null,null,null,null,null,null,null,null,null,null,null,null,null,null,null,null,null,null,null,null,null,null,null,null,null,null,null,null,null,null,null,null,null,null,null,null,null,null,null,null,null,null,null,null,null,null,null,null,null,null,null,null,null,null,null,null,null,null,null,null,null,null,null,null,100,12,12]
[null,null,null,null,null,null,null,null,null,null,null,null,null,null,null,null,null,null,null,null,null,null,null,null,null,null,null,null,null,null,null,null,null,null,null,null,null,null,null,null,null,null,null,null,null,null,null,null,null,null,null,null,null,null,null,null,null,null,null,null,null,null,null,null,null,null,null,null,null,null,null,null,null,null,null,null,null,null,null,null,null,null,null,null,null,null,100,12,12]
[null,null,null,null,null,null,null,null,null,null,null,null,null,null,null,null,null,null,null,null,null,null,null,null,null,null,null,null,null,null,null,null,null,null,null,null,null,null,null,null,null,null,null,null,null,null,null,null,null,null,null,null,null,null,null,null,null,null,null,null,null,null,null,null,null,null,null,null,null,null,null,null,null,null,null,null,null,null,null,null,null,null,null,null,null,null,100,12,12]
[null,null,null,null,null,null,null,null,null,null,null,null,null,null,null,null,null,null,null,null,null,null,null,null,null,null,null,null,null,null,null,null,null,null,null,null,null,null,null,null,null,null,null,null,null,null,null,null,null,null,null,null,null,null,null,null,null,null,null,null,null,null,null,null,null,null,null,null,null,null,null,null,null,null,null,null,null,null,null,null,null,null,null,null,null,null,100,12,12]
[null,null,null,null,null,null,null,null,null,null,null,null,null,null,null,null,null,null,null,null,null,null,null,null,null,null,null,null,null,null,null,null,null,null,null,null,null,null,null,null,null,null,null,null,null,null,null,null,null,null,null,null,null,null,null,null,null,null,null,null,null,null,null,null,null,null,null,null,null,null,null,null,null,null,null,null,null,null,null,null,null,null,null,null,null,null,100,12,12]
[null,null,null,null,null,null,null,null,null,null,null,null,null,null,null,null,null,null,null,null,null,null,null,null,null,null,null,null,null,null,null,null,null,null,null,null,null,null,null,null,null,null,null,null,null,null,null,null,null,null,null,null,null,null,null,null,null,null,null,null,null,null,null,null,null,null,null,null,null,null,null,null,null,null,null,null,null,null,null,null,null,null,null,null,null,null,100,12,12]
[null,null,null,null,null,null,null,null,null,null,null,null,null,null,null,null,null,null,null,null,null,null,null,null,null,null,null,null,null,null,null,null,null,null,null,null,null,null,null,null,null,null,null,null,null,null,null,null,null,null,null,null,null,null,null,null,null,null,null,null,null,null,null,null,null,null,null,null,null,null,null,null,null,null,null,null,null,null,null,null,null,null,null,null,null,null,{"$f":"LEN(CI40)","v":100},12,12]
[null,null,null,null,null,null,null,null,null,null,null,null,null,null,null,null,null,null,null,null,null,null,null,null,null,null,null,null,null,null,null,null,null,null,null,null,null,null,null,null,null,null,null,null,null,null,null,null,null,null,null,null,null,null,null,null,null,null,null,null,null,null,null,null,null,null,null,null,null,null,null,null,null,null,null,null,null,null,null,null,null,null,null,null,null,null,100,12,12]
[null,null,null,null,null,null,null,null,null,null,null,null,null,null,null,null,null,null,null,null,null,null,null,null,null,null,null,null,null,null,null,null,null,null,null,null,null,null,null,null,null,null,null,null,null,null,null,null,null,null,null,null,null,null,null,null,null,null,null,null,null,null,null,null,null,null,null,null,null,null,null,null,null,null,null,null,null,null,null,null,null,null,null,null,null,null,100,12,12]
[null,null,null,null,null,null,null,null,null,null,null,null,null,null,null,null,null,null,null,null,null,null,null,null,null,null,null,null,null,null,null,null,null,null,null,null,null,null,null,null,null,null,null,null,null,null,null,null,null,null,null,null,null,null,null,null,null,null,null,null,null,null,null,null,null,null,null,null,null,null,null,null,null,null,null,null,null,null,null,null,null,null,null,null,null,null,100,12,12]
[null,null,null,null,null,null,null,null,null,null,null,null,null,null,null,null,null,null,null,null,null,null,null,null,null,null,null,null,null,null,null,null,null,null,null,null,null,null,null,null,null,null,null,null,null,null,null,null,null,null,null,null,null,null,null,null,null,null,null,null,null,null,null,null,null,null,null,null,null,null,null,null,null,null,null,null,null,null,null,null,null,null,null,null,null,null,100,12,12]
[null,null,null,null,null,null,null,null,null,null,null,null,null,null,null,null,null,null,null,null,null,null,null,null,null,null,null,null,null,null,null,null,null,null,null,null,null,null,null,null,null,null,null,null,null,null,null,null,null,null,null,null,null,null,null,null,null,null,null,null,null,null,null,null,null,null,null,null,null,null,null,null,null,null,null,null,null,null,null,null,null,null,null,null,null,null,100,12,12]
[null,null,null,null,null,null,null,null,null,null,null,null,null,null,null,null,null,null,null,null,null,null,null,null,null,null,null,null,null,null,null,null,null,null,null,null,null,null,null,null,null,null,null,null,null,null,null,null,null,null,null,null,null,null,null,null,null,null,null,null,null,null,null,null,null,null,null,null,null,null,null,null,null,null,null,null,null,null,null,null,null,null,null,null,null,null,100,12,12]
[null,null,null,null,null,null,null,null,null,null,null,null,null,null,null,null,null,null,null,null,null,null,null,null,null,null,null,null,null,null,null,null,null,null,null,null,null,null,null,null,null,null,null,null,null,null,null,null,null,null,null,null,null,null,null,null,null,null,null,null,null,null,null,null,null,null,null,null,null,null,null,null,null,null,null,null,null,null,null,null,null,null,null,null,null,null,100,12,12]
[null,null,null,null,null,null,null,null,null,null,null,null,null,null,null,null,null,null,null,null,null,null,null,null,null,null,null,null,null,null,null,null,null,null,null,null,null,null,null,null,null,null,null,null,null,null,null,null,null,null,null,null,null,null,null,null,null,null,null,null,null,null,null,null,null,null,null,null,null,null,null,null,null,null,null,null,null,null,null,null,null,null,null,null,null,null,100,12,12]
[null,null,null,null,null,null,null,null,null,null,null,null,null,null,null,null,null,null,null,null,null,null,null,null,null,null,null,null,null,null,null,null,null,null,null,null,null,null,null,null,null,null,null,null,null,null,null,null,null,null,null,null,null,null,null,null,null,null,null,null,null,null,null,null,null,null,null,null,null,null,null,null,null,null,null,null,null,null,null,null,null,null,null,null,null,null,3,2,2]
[null,null,null,null,null,null,null,null,null,null,null,null,null,null,null,null,null,null,null,null,null,null,null,null,null,null,null,null,null,null,null,null,null,null,null,null,null,null,null,null,null,null,null,null,null,null,null,null,null,null,null,null,null,null,null,null,null,null,null,null,null,null,null,null,null,null,null,null,null,null,null,null,null,null,null,null,null,null,null,null,null,null,null,null,null,null,3,2,2]
[null,null,null,null,null,null,null,null,null,null,null,null,null,null,null,null,null,null,null,null,null,null,null,null,null,null,null,null,null,null,null,null,null,null,null,null,null,null,null,null,null,null,null,null,null,null,null,null,null,null,null,null,null,null,null,null,null,null,null,null,null,null,null,null,null,null,null,null,null,null,null,null,null,null,null,null,null,null,null,null,null,null,null,null,null,null,3,2,2]
[null,null,null,null,null,null,null,null,null,null,null,null,null,null,null,null,null,null,null,null,null,null,null,null,null,null,null,null,null,null,null,null,null,null,null,null,null,null,null,null,null,null,null,null,null,null,null,null,null,null,null,null,null,null,null,null,null,null,null,null,null,null,null,null,null,null,null,null,null,null,null,null,null,null,null,null,null,null,null,null,null,null,null,null,null,null,3,2,2]
[null,null,null,null,null,null,null,null,null,null,null,null,null,null,null,null,null,null,null,null,null,null,null,null,null,null,null,null,null,null,null,null,null,null,null,null,null,null,null,null,null,null,null,null,null,null,null,null,null,null,null,null,null,null,null,null,null,null,null,null,null,null,null,null,null,null,null,null,null,null,null,null,null,null,null,null,null,null,null,null,null,null,null,null,null,null,3,2,2]
[null,null,null,null,null,null,null,null,null,null,null,null,null,null,null,null,null,null,null,null,null,null,null,null,null,null,null,null,null,null,null,null,null,null,null,null,null,null,null,null,null,null,null,null,null,null,null,null,null,null,null,null,null,null,null,null,null,null,null,null,null,null,null,null,null,null,null,null,null,null,null,null,null,null,null,null,null,null,null,null,null,null,null,null,null,null,3,2,2]
[null,null,null,null,null,null,null,null,null,null,null,null,null,null,null,null,null,null,null,null,null,null,null,null,null,null,null,null,null,null,null,null,null,null,null,null,null,null,null,null,null,null,null,null,null,null,null,null,null,null,null,null,null,null,null,null,null,null,null,null,null,null,null,null,null,null,null,null,null,null,null,null,null,null,null,null,null,null,null,null,null,null,null,null,null,null,3,2,2]
[null,null,null,null,null,null,null,null,null,null,null,null,null,null,null,null,null,null,null,null,null,null,null,null,null,null,null,null,null,null,null,null,null,null,null,null,null,null,null,null,null,null,null,null,null,null,null,null,null,null,null,null,null,null,null,null,null,null,null,null,null,null,null,null,null,null,null,null,null,null,null,null,null,null,null,null,null,null,null,null,null,null,null,null,null,null,3,2,2]
[null,null,null,null,null,null,null,null,null,null,null,null,null,null,null,null,null,null,null,null,null,null,null,null,null,null,null,null,null,null,null,null,null,null,null,null,null,null,null,null,null,null,null,null,null,null,null,null,null,null,null,null,null,null,null,null,null,null,null,null,null,null,null,null,null,null,null,null,null,null,null,null,null,null,null,null,null,null,null,null,null,null,null,null,null,null,3,2,2]
[null,null,null,null,null,null,null,null,null,null,null,null,null,null,null,null,null,null,null,null,null,null,null,null,null,null,null,null,null,null,null,null,null,null,null,null,null,null,null,null,null,null,null,null,null,null,null,null,null,null,null,null,null,null,null,null,null,null,null,null,null,null,null,null,null,null,null,null,null,null,null,null,null,null,null,null,null,null,null,null,null,null,null,null,null,null,3,2,2]
[null,null,null,null,null,null,null,null,null,null,null,null,null,null,null,null,null,null,null,null,null,null,null,null,null,null,null,null,null,null,null,null,null,null,null,null,null,null,null,null,null,null,null,null,null,null,null,null,null,null,null,null,null,null,null,null,null,null,null,null,null,null,null,null,null,null,null,null,null,null,null,null,null,null,null,null,null,null,null,null,null,null,null,null,null,null,3,2,2]
[null,null,null,null,null,null,null,null,null,null,null,null,null,null,null,null,null,null,null,null,null,null,null,null,null,null,null,null,null,null,null,null,null,null,null,null,null,null,null,null,null,null,null,null,null,null,null,null,null,null,null,null,null,null,null,null,null,null,null,null,null,null,null,null,null,null,null,null,null,null,null,null,null,null,null,null,null,null,null,null,null,null,null,null,null,null,{"$f":"LEN(CI60)","v":3},2,2]
[null,null,null,null,null,null,null,null,null,null,null,null,null,null,null,null,null,null,null,null,null,null,null,null,null,null,null,null,null,null,null,null,null,null,null,null,null,null,null,null,null,null,null,null,null,null,null,null,null,null,null,null,null,null,null,null,null,null,null,null,null,null,null,null,null,null,null,null,null,null,null,null,null,null,null,null,null,null,null,null,null,null,null,null,null,null,3,2,2]
[null,null,null,null,null,null,null,null,null,null,null,null,null,null,null,null,null,null,null,null,null,null,null,null,null,null,null,null,null,null,null,null,null,null,null,null,null,null,null,null,null,null,null,null,null,null,null,null,null,null,null,null,null,null,null,null,null,null,null,null,null,null,null,null,null,null,null,null,null,null,null,null,null,null,null,null,null,null,null,null,null,null,null,null,null,null,3,2,2]
[null,null,null,null,null,null,null,null,null,null,null,null,null,null,null,null,null,null,null,null,null,null,null,null,null,null,null,null,null,null,null,null,null,null,null,null,null,null,null,null,null,null,null,null,null,null,null,null,null,null,null,null,null,null,null,null,null,null,null,null,null,null,null,null,null,null,null,null,null,null,null,null,null,null,null,null,null,null,null,null,null,null,null,null,null,null,3,2,2]
[null,null,null,null,null,null,null,null,null,null,null,null,null,null,null,null,null,null,null,null,null,null,null,null,null,null,null,null,null,null,null,null,null,null,null,null,null,null,null,null,null,null,null,null,null,null,null,null,null,null,null,null,null,null,null,null,null,null,null,null,null,null,null,null,null,null,null,null,null,null,null,null,null,null,null,null,null,null,null,null,null,null,null,null,null,null,3,2,2]
[null,null,null,null,null,null,null,null,null,null,null,null,null,null,null,null,null,null,null,null,null,null,null,null,null,null,null,null,null,null,null,null,null,null,null,null,null,null,null,null,null,null,null,null,null,null,null,null,null,null,null,null,null,null,null,null,null,null,null,null,null,null,null,null,null,null,null,null,null,null,null,null,null,null,null,null,null,null,null,null,null,null,null,null,null,null,3,2,2]
[null,null,null,null,null,null,null,null,null,null,null,null,null,null,null,null,null,null,null,null,null,null,null,null,null,null,null,null,null,null,null,null,null,null,null,null,null,null,null,null,null,null,null,null,null,null,null,null,null,null,null,null,null,null,null,null,null,null,null,null,null,null,null,null,null,null,null,null,null,null,null,null,null,null,null,null,null,null,null,null,null,null,null,null,null,null,3,2,2]
[null,null,null,null,null,null,null,null,null,null,null,null,null,null,null,null,null,null,null,null,null,null,null,null,null,null,null,null,null,null,null,null,null,null,null,null,null,null,null,null,null,null,null,null,null,null,null,null,null,null,null,null,null,null,null,null,null,null,null,null,null,null,null,null,null,null,null,null,null,null,null,null,null,null,null,null,null,null,null,null,null,null,null,null,null,null,3,2,2]
[null,null,null,null,null,null,null,null,null,null,null,null,null,null,null,null,null,null,null,null,null,null,null,null,null,null,null,null,null,null,null,null,null,null,null,null,null,null,null,null,null,null,null,null,null,null,null,null,null,null,null,null,null,null,null,null,null,null,null,null,null,null,null,null,null,null,null,null,null,null,null,null,null,null,null,null,null,null,null,null,null,null,null,null,null,null,3,2,2]
[null,null,null,null,null,null,null,null,null,null,null,null,null,null,null,null,null,null,null,null,null,null,null,null,null,null,null,null,null,null,null,null,null,null,null,null,null,null,null,null,null,null,null,null,null,null,null,null,null,null,null,null,null,null,null,null,null,null,null,null,null,null,null,null,null,null,null,null,null,null,null,null,null,null,null,null,null,null,null,null,null,null,null,null,null,null,3,2,2]
[null,null,null,null,null,null,null,null,null,null,null,null,null,null,null,null,null,null,null,null,null,null,null,null,null,null,null,null,null,null,null,null,null,null,null,null,null,null,null,null,null,null,null,null,null,null,null,null,null,null,null,null,null,null,null,null,null,null,null,null,null,null,null,null,null,null,null,null,null,null,null,null,null,null,null,null,null,null,null,null,null,null,null,null,null,null,3,2,2]
[null,null,null,null,null,null,null,null,null,null,null,null,null,null,null,null,null,null,null,null,null,null,null,null,null,null,null,null,null,null,null,null,null,null,null,null,null,null,null,null,null,null,null,null,null,null,null,null,null,null,null,null,null,null,null,null,null,null,null,null,null,null,null,null,null,null,null,null,null,null,null,null,null,null,null,null,null,null,null,null,null,null,null,null,null,null,3,2,2]
[null,null,null,null,null,null,null,null,null,null,null,null,null,null,null,null,null,null,null,null,null,null,null,null,null,null,null,null,null,null,null,null,null,null,null,null,null,null,null,null,null,null,null,null,null,null,null,null,null,null,null,null,null,null,null,null,null,null,null,null,null,null,null,null,null,null,null,null,null,null,null,null,null,null,null,null,null,null,null,null,null,null,null,null,null,null,3,2,2]
[null,null,null,null,null,null,null,null,null,null,null,null,null,null,null,null,null,null,null,null,null,null,null,null,null,null,null,null,null,null,null,null,null,null,null,null,null,null,null,null,null,null,null,null,null,null,null,null,null,null,null,null,null,null,null,null,null,null,null,null,null,null,null,null,null,null,null,null,null,null,null,null,null,null,null,null,null,null,null,null,null,null,null,null,null,null,3,2,2]
[null,null,null,null,null,null,null,null,null,null,null,null,null,null,null,null,null,null,null,null,null,null,null,null,null,null,null,null,null,null,null,null,null,null,null,null,null,null,null,null,null,null,null,null,null,null,null,null,null,null,null,null,null,null,null,null,null,null,null,null,null,null,null,null,null,null,null,null,null,null,null,null,null,null,null,null,null,null,null,null,null,null,null,null,null,null,3,2,2]
[null,null,null,null,null,null,null,null,null,null,null,null,null,null,null,null,null,null,null,null,null,null,null,null,null,null,null,null,null,null,null,null,null,null,null,null,null,null,null,null,null,null,null,null,null,null,null,null,null,null,null,null,null,null,null,null,null,null,null,null,null,null,null,null,null,null,null,null,null,null,null,null,null,null,null,null,null,null,null,null,null,null,null,null,null,null,3,2,2]
[null,null,null,null,null,null,null,null,null,null,null,null,null,null,null,null,null,null,null,null,null,null,null,null,null,null,null,null,null,null,null,null,null,null,null,null,null,null,null,null,null,null,null,null,null,null,null,null,null,null,null,null,null,null,null,null,null,null,null,null,null,null,null,null,null,null,null,null,null,null,null,null,null,null,null,null,null,null,null,null,null,null,null,null,null,null,3,2,2]
[null,null,null,null,null,null,null,null,null,null,null,null,null,null,null,null,null,null,null,null,null,null,null,null,null,null,null,null,null,null,null,null,null,null,null,null,null,null,null,null,null,null,null,null,null,null,null,null,null,null,null,null,null,null,null,null,null,null,null,null,null,null,null,null,null,null,null,null,null,null,null,null,null,null,null,null,null,null,null,null,null,null,null,null,null,null,3,2,2]
[null,null,null,null,null,null,null,null,null,null,null,null,null,null,null,null,null,null,null,null,null,null,null,null,null,null,null,null,null,null,null,null,null,null,null,null,null,null,null,null,null,null,null,null,null,null,null,null,null,null,null,null,null,null,null,null,null,null,null,null,null,null,null,null,null,null,null,null,null,null,null,null,null,null,null,null,null,null,null,null,null,null,null,null,null,null,3,2,2]
[null,null,null,null,null,null,null,null,null,null,null,null,null,null,null,null,null,null,null,null,null,null,null,null,null,null,null,null,null,null,null,null,null,null,null,null,null,null,null,null,null,null,null,null,null,null,null,null,null,null,null,null,null,null,null,null,null,null,null,null,null,null,null,null,null,null,null,null,null,null,null,null,null,null,null,null,null,null,null,null,null,null,null,null,null,null,3,2,2]
[null,null,null,null,null,null,null,null,null,null,null,null,null,null,null,null,null,null,null,null,null,null,null,null,null,null,null,null,null,null,null,null,null,null,null,null,null,null,null,null,null,null,null,null,null,null,null,null,null,null,null,null,null,null,null,null,null,null,null,null,null,null,null,null,null,null,null,null,null,null,null,null,null,null,null,null,null,null,null,null,null,null,null,null,null,null,{"$f":"LEN(CI80)","v":3},2,2]
[null,null,null,null,null,null,null,null,null,null,null,null,null,null,null,null,null,null,null,null,null,null,null,null,null,null,null,null,null,null,null,null,null,null,null,null,null,null,null,null,null,null,null,null,null,null,null,null,null,null,null,null,null,null,null,null,null,null,null,null,null,null,null,null,null,null,null,null,null,null,null,null,null,null,null,null,null,null,null,null,null,null,null,null,null,null,3,2,2]
[null,null,null,null,null,null,null,null,null,null,null,null,null,null,null,null,null,null,null,null,null,null,null,null,null,null,null,null,null,null,null,null,null,null,null,null,null,null,null,null,null,null,null,null,null,null,null,null,null,null,null,null,null,null,null,null,null,null,null,null,null,null,null,null,null,null,null,null,null,null,null,null,null,null,null,null,null,null,null,null,null,null,null,null,null,null,3,2,2]
[null,null,null,null,null,null,null,null,null,null,null,null,null,null,null,null,null,null,null,null,null,null,null,null,null,null,null,null,null,null,null,null,null,null,null,null,null,null,null,null,null,null,null,null,null,null,null,null,null,null,null,null,null,null,null,null,null,null,null,null,null,null,null,null,null,null,null,null,null,null,null,null,null,null,null,null,null,null,null,null,null,null,null,null,null,null,3,2,2]
[null,null,null,null,null,null,null,null,null,null,null,null,null,null,null,null,null,null,null,null,null,null,null,null,null,null,null,null,null,null,null,null,null,null,null,null,null,null,null,null,null,null,null,null,null,null,null,null,null,null,null,null,null,null,null,null,null,null,null,null,null,null,null,null,null,null,null,null,null,null,null,null,null,null,null,null,null,null,null,null,null,null,null,null,null,null,3,2,2]
[null,null,null,null,null,null,null,null,null,null,null,null,null,null,null,null,null,null,null,null,null,null,null,null,null,null,null,null,null,null,null,null,null,null,null,null,null,null,null,null,null,null,null,null,null,null,null,null,null,null,null,null,null,null,null,null,null,null,null,null,null,null,null,null,null,null,null,null,null,null,null,null,null,null,null,null,null,null,null,null,null,null,null,null,null,null,3,2,2]
[null,null,null,null,null,null,null,null,null,null,null,null,null,null,null,null,null,null,null,null,null,null,null,null,null,null,null,null,null,null,null,null,null,null,null,null,null,null,null,null,null,null,null,null,null,null,null,null,null,null,null,null,null,null,null,null,null,null,null,null,null,null,null,null,null,null,null,null,null,null,null,null,null,null,null,null,null,null,null,null,null,null,null,null,null,null,3,2,2]
[null,null,null,null,null,null,null,null,null,null,null,null,null,null,null,null,null,null,null,null,null,null,null,null,null,null,null,null,null,null,null,null,null,null,null,null,null,null,null,null,null,null,null,null,null,null,null,null,null,null,null,null,null,null,null,null,null,null,null,null,null,null,null,null,null,null,null,null,null,null,null,null,null,null,null,null,null,null,null,null,null,null,null,null,null,null,3,2,2]
[null,null,null,null,null,null,null,null,null,null,null,null,null,null,null,null,null,null,null,null,null,null,null,null,null,null,null,null,null,null,null,null,null,null,null,null,null,null,null,null,null,null,null,null,null,null,null,null,null,null,null,null,null,null,null,null,null,null,null,null,null,null,null,null,null,null,null,null,null,null,null,null,null,null,null,null,null,null,null,null,null,null,null,null,null,null,3,2,2]
[null,null,null,null,null,null,null,null,null,null,null,null,null,null,null,null,null,null,null,null,null,null,null,null,null,null,null,null,null,null,null,null,null,null,null,null,null,null,null,null,null,null,null,null,null,null,null,null,null,null,null,null,null,null,null,null,null,null,null,null,null,null,null,null,null,null,null,null,null,null,null,null,null,null,null,null,null,null,null,null,null,null,null,null,null,null,3,2,2]
[null,null,null,null,null,null,null,null,null,null,null,null,null,null,null,null,null,null,null,null,null,null,null,null,null,null,null,null,null,null,null,null,null,null,null,null,null,null,null,null,null,null,null,null,null,null,null,null,null,null,null,null,null,null,null,null,null,null,null,null,null,null,null,null,null,null,null,null,null,null,null,null,null,null,null,null,null,null,null,null,null,null,null,null,null,null,1,1,1]
[null,null,null,null,null,null,null,null,null,null,null,null,null,null,null,null,null,null,null,null,null,null,null,null,null,null,null,null,null,null,null,null,null,null,null,null,null,null,null,null,null,null,null,null,null,null,null,null,null,null,null,null,null,null,null,null,null,null,null,null,null,null,null,null,null,null,null,null,null,null,null,null,null,null,null,null,null,null,null,null,null,null,null,null,null,null,1,1,1]
[null,null,null,null,null,null,null,null,null,null,null,null,null,null,null,null,null,null,null,null,null,null,null,null,null,null,null,null,null,null,null,null,null,null,null,null,null,null,null,null,null,null,null,null,null,null,null,null,null,null,null,null,null,null,null,null,null,null,null,null,null,null,null,null,null,null,null,null,null,null,null,null,null,null,null,null,null,null,null,null,null,null,null,null,null,null,1,1,1]
[null,null,null,null,null,null,null,null,null,null,null,null,null,null,null,null,null,null,null,null,null,null,null,null,null,null,null,null,null,null,null,null,null,null,null,null,null,null,null,null,null,null,null,null,null,null,null,null,null,null,null,null,null,null,null,null,null,null,null,null,null,null,null,null,null,null,null,null,null,null,null,null,null,null,null,null,null,null,null,null,null,null,null,null,null,null,1,1,1]
[null,null,null,null,null,null,null,null,null,null,null,null,null,null,null,null,null,null,null,null,null,null,null,null,null,null,null,null,null,null,null,null,null,null,null,null,null,null,null,null,null,null,null,null,null,null,null,null,null,null,null,null,null,null,null,null,null,null,null,null,null,null,null,null,null,null,null,null,null,null,null,null,null,null,null,null,null,null,null,null,null,null,null,null,null,null,1,1,1]
[null,null,null,null,null,null,null,null,null,null,null,null,null,null,null,null,null,null,null,null,null,null,null,null,null,null,null,null,null,null,null,null,null,null,null,null,null,null,null,null,null,null,null,null,null,null,null,null,null,null,null,null,null,null,null,null,null,null,null,null,null,null,null,null,null,null,null,null,null,null,null,null,null,null,null,null,null,null,null,null,null,null,null,null,null,null,1,1,1]
[null,null,null,null,null,null,null,null,null,null,null,null,null,null,null,null,null,null,null,null,null,null,null,null,null,null,null,null,null,null,null,null,null,null,null,null,null,null,null,null,null,null,null,null,null,null,null,null,null,null,null,null,null,null,null,null,null,null,null,null,null,null,null,null,null,null,null,null,null,null,null,null,null,null,null,null,null,null,null,null,null,null,null,null,null,null,1,1,1]
[null,null,null,null,null,null,null,null,null,null,null,null,null,null,null,null,null,null,null,null,null,null,null,null,null,null,null,null,null,null,null,null,null,null,null,null,null,null,null,null,null,null,null,null,null,null,null,null,null,null,null,null,null,null,null,null,null,null,null,null,null,null,null,null,null,null,null,null,null,null,null,null,null,null,null,null,null,null,null,null,null,null,null,null,null,null,1,1,1]

{"sheet":"Création CRE IMP","index":4,"n_rows":53,"n_cols":81,"rows_kept":53,"cut":false,"hidden":false,"merged":[[0,0,0,3]]}
["CRE CONCATENE (données de sortie)",null,null,null,"DONNEES PARAMETRABLES",null,null,null,null,null,null,null,"CRE DECOUPE (détails intermédiaires)"]
[null,null,null,null,null,null,null,null,null,null,null,"Début",1,3,9,11,16,21,23,26,30,32,34,35,40,45,64,72,87,103,106,107,110,111,134,137,145,165,167,170,190,202,206,207,212,217,228,230,233,239,249,252,286,289,291,307,328,352,358,364,369,385,401,402,406,414,426,438,439,444,463,471,477,502,670,682,694,698,711,761,782]
[null,null,null,null,null,null,null,null,null,null,null,"Lg",2,6,2,5,5,2,3,4,2,2,1,5,5,19,8,15,16,3,1,3,1,23,3,8,20,2,3,20,12,4,1,5,5,11,2,3,6,10,3,34,3,2,16,21,24,6,6,5,16,16,1,4,8,12,12,1,5,19,8,6,25,168,12,12,4,13,50,21,220]
[null,null,null,null,null,null,null,null,null,null,null,"Specification","‘14’ ",0,"Domestique : \n« Z1 » : pour impayés reçus\nMasterCard  : \n« X5 » : pour impayés reçus\nVisa : \n« X4 » : pour impayés reçus\n","Code banque de domiciliation du porteur","Code banque de domiciliation du commerçant","‘XA’","\nCR1 : si code opération « 500», « 501», « 502», « 540»\n\nCRA : AOCT impayé reçu si code «401», «403»\n","Spaces","Si CDOPEI (table impayé) = 'FAC' ou 'CAS' ou 'AVO' alors ‘09’\n\nSi CDOPEI (table impayé) = 'DAB' è ‘29’","Si CDOPEI (table impayé) = 'FAC' ou 'CAS' ou 'AVO' alors ‘03’\n\nSi CDOPEI (table impayé) = 'DAB' è ‘23’","2 : commerçant","CDETB9 de l’impayé","CDGUICH de l’impayé","Numéro de carte porteur de l'impayé : si généré en 16 caractères alors paddé à droite avec les espaces \nPAN est tokénisé ","Date de vente (SSAAMMJJ) pour une transaction de litige\nDate de remise pour une remise de paiement ou de retrait","SIRET de l’impayé","Montant brut en centimes correspondant à l’opération de :\n'- CR1 : Impayé (ou AOCT impayé) du montant brut de l’impayé partiel ou total reçu \n'- RP1 : Représentation ou AOCT de représentation  montant brut de la représentation (correspondant au montant total ou partiel de l’impayé reçu)\n'- IC1 : Imputation commerçant è montant brut  de l’impayé partiel ou total reçu \n'- PPT : Perte et profit du montant brut  de l’impayé partiel ou total reçu\n'- AI1 : Annulation imputation commerçant du montant brut de l’impayé partiel ou total reçu ","\"978\"","Nombre de décimales du montant  brut","« IM» pour  impayé\n« AIM » pour annulation impayé","Code réseau de l'impayé","NUARN de l’impayé","FAC si SR04 = 500 ou 403\nAVO si SR04 = 502 ou 401","Selon le réseau au format SSAAMMJJ","LILOCA de l’impayé","CDDEPT de l’impayé","CDPAYS de l’impayé","RAISOA de l’impayé","NURFI2 de l’impayé","Motif de l’impayé dans la codification du format de compensation reçu","1 : first chargeback  2 : second chargeback","Code banque issu du référentiel commerçant par rapport au SIRET","Code siège du RIB issu du référentiel commerçant par rapport au SIRET","Numéro de compte du RIB issu du référentiel commerçant par rapport au SIRET  ","Clé RIB calculée (YD04-CLRIBA)\nen se servant des informations issues du référentiel commerçant par rapport au SIRET ","Numéro de terminal pour une remise commerçant","spaces","NUMCO de l'impayé","Code ICA de l’impayé reçu","A blanc pour l’instant","Devise du montant compensé de l’impayé reçu en code ISO 3166-1 ","NB décimale du montant compensé de l’impayé reçu","Montant compensé de l’impayé reçu","ex : LMA-16638-I-1911-0009",null,"Format : JJMMAA","Donnée uniquement pour les remises commerçant ou retrait","Donnée uniquement pour les remises commerçant ou retrait","Donnée uniquement pour les remises commerçant ou retrait","Montant brut en euro","Code usage","Indique si le litige est géré dans LMA ou dans un outil réseau (VROL pour Visa)\n« LMA » si géré dans LMA\n« RSX » si géré dans les outils Réseaux (VROL pour Visa)","DTCERE de la transaction mis sous le format ssaammjj (non rempli pour imp)","Pas de comm commerçant ","Différence entre (montant brut en euro et montant compensé) sur 2 décimales","spaces","Code établissement gestionnaire de l’acquéreur","numéro de carte porteur : si généré du 16 caractères, complété par des blancs","Date d’enregistrement de la transaction dans les tables au format SSAAMMJJ ","Numéro attribué à l’impayé : ce numéro est crée par LMA lors de la prise en compte de l’impayé","Identifiant de remise issue de l’header CB2C",null,"Filler","Montant de la commission agent ","Filler","Filler","Filler","Filler","Filler"]
[null,null,null,null,null,null,null,null,null,null,null,"Libellé","Code type d’enregistrement","Numéro séquentiel","Code opération","Code banque émetteur","Code banque destinataire","Code application échange","Code sous application",null,"Code origine flux","Code destination flux","Code nature de flux comptable","Code établissement","Guichet accepteur","Numéro de carte","Date de vente","SIRET","Montant brut","Devise de réconciliation nationale liée au montant brut","Nombre de décimales du montant brut","Type opération","Code réseau","Référence archivage","Code opération interne","Date de règlement interbancaire","Localisation","Code département","Code pays","Raison sociale","Référence impayé reçue","Motif impayé","Code cycle impayé","Code établissement du RIB","Code Guichet du RIB ","Numéro de compte","Clé RIB","Numéro de terminal","Filler","Numéro de contrat accepteur","Code ICA","IBAN","Devise du montant compensé","nombre décimal mt compensé","Montant compensé","Référence externe","Nom du commerçant","Date de Valeur","Nombre de factures","Numéro de remise","Montant net","Montant brut en euro","Code usage","Mode de Traitement du Litige","Date envoi en compensation","Montant commission commerçant ","Montant commission Interchange","Type de porteur","code établissement","Numéro de carte","Date archivage","Numéro séquentiel","Identifiant de Remise","FILLER","FILLER","MTCOAG","FILLER","FILLER","FILLER","FILLER","FILLER"]
["Mode d'alimentation de ce fichier",null,"Généré automatiquement, nb de ligne voulu à copier coller dans Notepad)","Fixe","Variable à saisir JJ/MM/AAAA","Variable liste déroulante","Variable liste déroulante","Variable à saisir 0,00","Variable à saisir 0,00","Variable à saisir 0,00","Variable à saisir","Mode d'alimentation de ce fichier","FIXE","FIXE","FIXE","FIXE","FIXE","FIXE","FIXE","FIXE","FIXE","FIXE","FIXE","FIXE","FIXE","FIXE","DEDUITE","DEDUITE","DEDUITE","FIXE","FIXE","FIXE","FIXE","FIXE","FIXE","DEDUITE","FIXE","FIXE","FIXE","DEDUITE","FIXE","FIXE","FIXE","FIXE","FIXE","DEDUITE","DEDUITE","FIXE","FIXE","DEDUITE","FIXE","FIXE","FIXE","FIXE","DEDUITE","FIXE","DEDUITE","DEDUITE","FIXE","FIXE","DEDUITE","DEDUITE","FIXE","FIXE","DEDUITE","DEDUITE","DEDUITE","FIXE","FIXE","DEDUITE","FIXE","FIXE","FIXE","FIXE","FIXE","FIXE","FIXE","FIXE","FIXE","FIXE","FIXE"]
["CRE concerné","CRE ACTIF","CRE concaténé","Opération (CDOPEI)","Date de valeur de l'impayé (DTVAL)","Réseau (IDSCPT)","Commerçant","Montant Brut impayé","Montant Frais rejet ","Montant interchange (non facturée au client) (MTINTVMC)","Code motif impayé","Code","CEENR","NUSQC","CEOPE","CEEMI","CEDES","CEAPC","CEMAP","FILLER","CECFTO","CECFTD","CDNAFL","CDETB9","CDGUICH","NUISOA","DTVEN","ZSIRET","MTBRUT","CDDEV","NBDEC","TYPOPE","IDSPCT","NUARN","CDOPEI","DTREGLI","LILOCA","CDDEPT","CDPAYS","RAISOA","NURFI2","COANO","COCYIM","CEETRX","CEGUIX","NUCTEA","CLRIBX","NUTP","Filler","NUMCO","CDICA","CDIBAN","CDDEVC","NBDECC","MTCOMP","REFEXT","NMCM","DTVL","NBFCT","NUREM","MTNT","MTBREUR","DSPUSG","MDTRLT","DTCOMP","MTTTCITR","MTCOMINT","TYPO","CDETB9","NUISOA","DTARCH","NUSDI","IDREM","FILLER1","Frais IMP","MTCOAG","PAYMETHOD","FRAISACQ","NUMCO2LONG","NEW","FILLER"]
["Enregistrement 1","oui",{"$f":"IF(B8=\"OUI\",CONCATENATE(M8,N8,O8,P8,Q8,R8,S8,T8,U8,V8,W8,X8,Y8,Z8,AA8,AB8,AC8,AD8,AE8,AF8,AG8,AH8,AI8,AJ8,AK8,AL8,AM8,AN8,AO8,AP8,AQ8,AR8,AS8,AT8,AU8,AV8,AW8,AX8,AY8,AZ8,BA8,BB8,BC8,BD8,BE8,BF8,BG8,BH8,BI8,BJ8,BK8,BL8,BM8,BN8,BO8,BP8,BQ8,BR8,BS8,BT8,BU8,BV8,BW8,BX8),\"CRE NON ACTIF\")","v":"14000000X41702817028XACR1    090321702892282513264KHYODHNJ313112022121860903400190001 00000000000020509782IM V           af2342567891FAC2022121934 RUE DU TEST      13FRACM_34_AG1           4286489705710073117028922822829306023493001      9556034                                        EUR020000000000002050LMA-17028-I-2105-0003CM_34                   191222000000     00000000000020500000000000002050             000000000000000000000000 00000464321654613135646120221219000003002252                                                                                                                                                                                           000000000000000000000000"},"PaymentChargeback","2022-12-19","VISA","CM_34_AG1",20.5,0,0,"0073","CRE 1","14","000000",{"$f":"IF(F8=\"CB\",\"Z1\",IF(F8=\"MC\",\"X5\",\"X4\"))","v":"X4"},"17028","17028","XA","CR1","    ","09","03","2","17028","92282","513264KHYODHNJ31311",{"$f":"TEXT(E8-1,\"aaaammjj\")","v":"20221218"},{"$f":"VLOOKUP(G8,'Listes déroulantes'!G:I,3,FALSE)","v":"60903400190001 "},{"$f":"RIGHT(CONCATENATE(\"0000000000000000\",H8*100),16)","v":"0000000000002050"},"978","2","IM ",{"$f":"IF(F8=\"CB\",\"S\",IF(F8=\"MC\",\"I\",\"V\"))","v":"V"},"           af2342567891","FAC",{"$f":"TEXT(E8,\"aaaammjj\")","v":"20221219"},{"$f":"VLOOKUP(G8,'Listes déroulantes'!G:O,9,FALSE)","v":"34 RUE DU TEST      "},"13","FRA",{"$f":"VLOOKUP(G8,'Listes déroulantes'!G:H,2,FALSE)","v":"CM_34_AG1           "},428648970571,{"$f":"K8","v":"0073"},1,"17028","92282",{"$f":"VLOOKUP(G8,'Listes déroulantes'!G:N,8,FALSE)","v":"28293060234"},"93","001","      ",{"$f":"VLOOKUP(G8,'Listes déroulantes'!G:J,4,FALSE)","v":"9556034   "},"   ","                                  ","EUR","02",{"$f":"RIGHT(CONCATENATE(\"0000000000000000\",(H8-J8)*100),16)","v":"0000000000002050"},"LMA-17028-I-2105-0003",{"$f":"VLOOKUP(G8,'Listes déroulantes'!G:M,7,FALSE)","v":"CM_34                   "},{"$f":"TEXT(E8,\"jjmmaa\")","v":"191222"},"000000","     ",{"$f":"RIGHT(CONCATENATE(\"0000000000000000\",H8*100),16)","v":"0000000000002050"},{"$f":"RIGHT(CONCATENATE(\"0000000000000000\",H8*100),16)","v":"0000000000002050"}," ","    ","        ","000000000000",{"$f":"RIGHT(CONCATENATE(\"0000000000000000\",J8*100),12)","v":"000000000000"}," ","00000","4643216546131356461",{"$f":"TEXT(E8,\"aaaammjj\")","v":"20221219"},"000003",{"$f":"IF(F8=\"CB\",(CONCATENATE(\"50003056125\",TEXT(E8-1,\"aammjj\"),\"0300    \")),\"002252                   \")","v":"002252                   "},"                                                                                                                                                                        ",{"$f":"RIGHT(CONCATENATE(\"0000000000000000\",I8*100),12)","v":"000000000000"},"000000000000","    ","             ","                                                  ","20228380131          ","                                                                                                                                                                                                                            "]
["Enregistrement 2","oui",{"$f":"IF(B9=\"OUI\",CONCATENATE(M9,N9,O9,P9,Q9,R9,S9,T9,U9,V9,W9,X9,Y9,Z9,AA9,AB9,AC9,AD9,AE9,AF9,AG9,AH9,AI9,AJ9,AK9,AL9,AM9,AN9,AO9,AP9,AQ9,AR9,AS9,AT9,AU9,AV9,AW9,AX9,AY9,AZ9,BA9,BB9,BC9,BD9,BE9,BF9,BG9,BH9,BI9,BJ9,BK9,BL9,BM9,BN9,BO9,BP9,BQ9,BR9,BS9,BT9,BU9,BV9,BW9,BX9),\"CRE NON ACTIF\")","v":"14000000X51702817028XACR1    090321702892282513264KHYODHNJ313122022121860903400190001 00000000000054009782IM I           af2342567892FAC2022121934 RUE DU TEST      13FRACM_34_AG1           4286489705720073117028922822829306023493001      9556034                                        EUR020000000000005400LMA-17028-I-2105-0004CM_34                   191222000000     00000000000054000000000000005400             000000000000000000000000 00000464321654613135646120221219000004002252                                                                                                                                                                                           000000000000000000000000"},"PaymentChargeback","2022-12-19","MC","CM_34_AG1",54,0,0,"0073","CRE 2","14","000000",{"$f":"IF(F9=\"CB\",\"Z1\",IF(F9=\"MC\",\"X5\",\"X4\"))","v":"X5"},"17028","17028","XA","CR1","    ","09","03","2","17028","92282","513264KHYODHNJ31312",{"$f":"TEXT(E9-1,\"aaaammjj\")","v":"20221218"},{"$f":"VLOOKUP(G9,'Listes déroulantes'!G:I,3,FALSE)","v":"60903400190001 "},"0000000000005400","978","2","IM ",{"$f":"IF(F9=\"CB\",\"S\",IF(F9=\"MC\",\"I\",\"V\"))","v":"I"},"           af2342567892","FAC",{"$f":"TEXT(E9,\"aaaammjj\")","v":"20221219"},{"$f":"VLOOKUP(G9,'Listes déroulantes'!G:O,9,FALSE)","v":"34 RUE DU TEST      "},"13","FRA",{"$f":"VLOOKUP(G9,'Listes déroulantes'!G:H,2,FALSE)","v":"CM_34_AG1           "},428648970572,{"$f":"K9","v":"0073"},1,"17028","92282",{"$f":"VLOOKUP(G9,'Listes déroulantes'!G:N,8,FALSE)","v":"28293060234"},"93","001","      ",{"$f":"VLOOKUP(G9,'Listes déroulantes'!G:J,4,FALSE)","v":"9556034   "},"   ","                                  ","EUR","02","0000000000005400","LMA-17028-I-2105-0004",{"$f":"VLOOKUP(G9,'Listes déroulantes'!G:M,7,FALSE)","v":"CM_34                   "},{"$f":"TEXT(E9,\"jjmmaa\")","v":"191222"},"000000","     ",{"$f":"RIGHT(CONCATENATE(\"0000000000000000\",H9*100),16)","v":"0000000000005400"},"0000000000005400"," ","    ","        ","000000000000","000000000000"," ","00000","4643216546131356461",{"$f":"TEXT(E9,\"aaaammjj\")","v":"20221219"},"000004","002252                   ","                                                                                                                                                                        ",{"$f":"RIGHT(CONCATENATE(\"0000000000000000\",I9*100),12)","v":"000000000000"},"000000000000","    ","             ","                                                  ","20228380132          ","                                                                                                                                                                                                                            "]
["Enregistrement 3","oui",{"$f":"IF(B10=\"OUI\",CONCATENATE(M10,N10,O10,P10,Q10,R10,S10,T10,U10,V10,W10,X10,Y10,Z10,AA10,AB10,AC10,AD10,AE10,AF10,AG10,AH10,AI10,AJ10,AK10,AL10,AM10,AN10,AO10,AP10,AQ10,AR10,AS10,AT10,AU10,AV10,AW10,AX10,AY10,AZ10,BA10,BB10,BC10,BD10,BE10,BF10,BG10,BH10,BI10,BJ10,BK10,BL10,BM10,BN10,BO10,BP10,BQ10,BR10,BS10,BT10,BU10,BV10,BW10,BX10),\"CRE NON ACTIF\")","v":"14000000Z11702817028XACR1    090321702892282513264KHYODHNJ313132022121860903400190001 00000000000101009782IM S           af2342567893FAC2022121934 RUE DU TEST      13FRACM_34_AG1           4286489705734853117028922822829306023493001      9556034                                        EUR020000000000010100LMA-17028-I-2105-0005CM_34                   191222000000     00000000000101000000000000010100             000000000000000000000000 00000464321654613135646120221219000005500030561252212180300                                                                                                                                                                            000000000000000000000000"},"PaymentChargeback","2022-12-19","CB","CM_34_AG1",101,0,0,"4853","CRE 3","14","000000","Z1","17028","17028","XA","CR1","    ","09","03","2","17028","92282","513264KHYODHNJ31313","20221218",{"$f":"VLOOKUP(G10,'Listes déroulantes'!G:I,3,FALSE)","v":"60903400190001 "},"0000000000010100","978","2","IM ","S","           af2342567893","FAC","20221219",{"$f":"VLOOKUP(G10,'Listes déroulantes'!G:O,9,FALSE)","v":"34 RUE DU TEST      "},"13","FRA",{"$f":"VLOOKUP(G10,'Listes déroulantes'!G:H,2,FALSE)","v":"CM_34_AG1           "},428648970573,"4853",1,"17028","92282",{"$f":"VLOOKUP(G10,'Listes déroulantes'!G:N,8,FALSE)","v":"28293060234"},"93","001","      ",{"$f":"VLOOKUP(G10,'Listes déroulantes'!G:J,4,FALSE)","v":"9556034   "},"   ","                                  ","EUR","02","0000000000010100","LMA-17028-I-2105-0005",{"$f":"VLOOKUP(G10,'Listes déroulantes'!G:M,7,FALSE)","v":"CM_34                   "},"191222","000000","     ","0000000000010100","0000000000010100"," ","    ","        ","000000000000","000000000000"," ","00000","4643216546131356461","20221219","000005","500030561252212180300    ","                                                                                                                                                                        ","000000000000","000000000000","    ","             ","                                                  ","20228380133          ","                                                                                                                                                                                                                            "]
["Enregistrement 4","oui","14000000X41702817028XACR1    090321702892282513264KHYODHNJ313142022121860903200190001 00000000000086239782IM V           af2342567894FAC2022121932 RUE DU TEST      13FRACM_32               4286489705744853117028922822829306023293001      9556032                                        EUR020000000000008623LMA-17028-I-2105-0006CM_32                   191222000000     00000000000086230000000000008623             000000000000000000000000 00000464321654613135646120221219000006002252                                                                                                                                                                                           000000000000000000000000","PaymentChargeback","2022-12-19","VISA","CM_32_VAD",86.23,0,0,"4853","CRE 4","14","000000","X4","17028","17028","XA","CR1","    ","09","03","2","17028","92282","513264KHYODHNJ31314","20221218",{"$f":"VLOOKUP(G11,'Listes déroulantes'!G:I,3,FALSE)","v":"60903200190001 "},"0000000000008623","978","2","IM ","V","           af2342567894","FAC","20221219",{"$f":"VLOOKUP(G11,'Listes déroulantes'!G:O,9,FALSE)","v":"32 RUE DU TEST      "},"13","FRA",{"$f":"VLOOKUP(G11,'Listes déroulantes'!G:H,2,FALSE)","v":"CM_32               "},428648970574,"4853",1,"17028","92282",{"$f":"VLOOKUP(G11,'Listes déroulantes'!G:N,8,FALSE)","v":"28293060232"},"93","001","      ",{"$f":"VLOOKUP(G11,'Listes déroulantes'!G:J,4,FALSE)","v":"9556032   "},"   ","                                  ","EUR","02","0000000000008623","LMA-17028-I-2105-0006",{"$f":"VLOOKUP(G11,'Listes déroulantes'!G:M,7,FALSE)","v":"CM_32                   "},"191222","000000","     ","0000000000008623","0000000000008623"," ","    ","        ","000000000000","000000000000"," ","00000","4643216546131356461","20221219","000006","002252                   ","                                                                                                                                                                        ","000000000000","000000000000","    ","             ","                                                  ","20228380134          ","                                                                                                                                                                                                                            "]
["Enregistrement 5","oui","14000000X51702817028XACR1    090321702892282513264KHYODHNJ313152022121860903200190001 00000000000150009782IM I           af2342567895FAC2022121932 RUE DU TEST      13FRACM_32               4286489705750045117028922822829306023293001      9556032                                        EUR020000000000014970LMA-17028-I-2105-0007CM_32                   191222000000     00000000000150000000000000015000             000000000000000000000030 00000464321654613135646120221219000007002252                                                                                                                                                                                           000000000000000000000000","PaymentChargeback","2022-12-19","MC","CM_32_VAD",150,0,0.3,"0045","CRE 5","14","000000","X5","17028","17028","XA","CR1","    ","09","03","2","17028","92282","513264KHYODHNJ31315","20221218",{"$f":"VLOOKUP(G12,'Listes déroulantes'!G:I,3,FALSE)","v":"60903200190001 "},"0000000000015000","978","2","IM ","I","           af2342567895","FAC","20221219",{"$f":"VLOOKUP(G12,'Listes déroulantes'!G:O,9,FALSE)","v":"32 RUE DU TEST      "},"13","FRA",{"$f":"VLOOKUP(G12,'Listes déroulantes'!G:H,2,FALSE)","v":"CM_32               "},428648970575,"0045",1,"17028","92282",{"$f":"VLOOKUP(G12,'Listes déroulantes'!G:N,8,FALSE)","v":"28293060232"},"93","001","      ",{"$f":"VLOOKUP(G12,'Listes déroulantes'!G:J,4,FALSE)","v":"9556032   "},"   ","                                  ","EUR","02","0000000000014970","LMA-17028-I-2105-0007",{"$f":"VLOOKUP(G12,'Listes déroulantes'!G:M,7,FALSE)","v":"CM_32                   "},"191222","000000","     ","0000000000015000","0000000000015000"," ","    ","        ","000000000000","000000000030"," ","00000","4643216546131356461","20221219","000007","002252                   ","                                                                                                                                                                        ","000000000000","000000000000","    ","             ","                                                  ","20228380135          ","                                                                                                                                                                                                                            "]
["Enregistrement 6","oui","14000000Z11702817028XACR1    090321702892282513264KHYODHNJ313162022121860903200190001 00000000000013559782IM S           af2342567896FAC2022121932 RUE DU TEST      13FRACM_32               4286489705760045117028922822829306023293001      9556032                                        EUR020000000000001352LMA-17028-I-2105-0008CM_32                   191222000000     00000000000013550000000000001355             000000000000000000000003 00000464321654613135646120221219000008500030561252212180300                                                                                                                                                                            000000000000000000000000","PaymentChargeback","2022-12-19","CB","CM_32_VAD",13.55,0,0.03,"0045","CRE 6","14","000000","Z1","17028","17028","XA","CR1","    ","09","03","2","17028","92282","513264KHYODHNJ31316","20221218",{"$f":"VLOOKUP(G13,'Listes déroulantes'!G:I,3,FALSE)","v":"60903200190001 "},"0000000000001355","978","2","IM ","S","           af2342567896","FAC","20221219",{"$f":"VLOOKUP(G13,'Listes déroulantes'!G:O,9,FALSE)","v":"32 RUE DU TEST      "},"13","FRA",{"$f":"VLOOKUP(G13,'Listes déroulantes'!G:H,2,FALSE)","v":"CM_32               "},428648970576,"0045",1,"17028","92282",{"$f":"VLOOKUP(G13,'Listes déroulantes'!G:N,8,FALSE)","v":"28293060232"},"93","001","      ",{"$f":"VLOOKUP(G13,'Listes déroulantes'!G:J,4,FALSE)","v":"9556032   "},"   ","                                  ","EUR","02","0000000000001352","LMA-17028-I-2105-0008",{"$f":"VLOOKUP(G13,'Listes déroulantes'!G:M,7,FALSE)","v":"CM_32                   "},"191222","000000","     ","0000000000001355","0000000000001355"," ","    ","        ","000000000000","000000000003"," ","00000","4643216546131356461","20221219","000008","500030561252212180300    ","                                                                                                                                                                        ","000000000000","000000000000","    ","             ","                                                  ","20228380136          ","                                                                                                                                                                                                                            "]
["Enregistrement 7","oui","14000000Z11702817028XACR1    090321702892282513264KHYODHNJ313172022121860903600190001 00000000000032009782IM S           af2342567897FAC2022121936 RUE DU TEST      13FRACM_36               4286489705770045117028922822829306023693001      9556036                                        EUR020000000000003194LMA-17028-I-2105-0009CM_36                   191222000000     00000000000032000000000000003200             000000000000000000000006 00000464321654613135646120221219000009500030561252212180300                                                                                                                                                                            000000000000000000000000","PaymentChargeback","2022-12-19","CB","CM_36_PDPAG1",32,0,0.06,"0045","CRE 7","14","000000","Z1","17028","17028","XA","CR1","    ","09","03","2","17028","92282","513264KHYODHNJ31317",{"$f":"TEXT(E14-1,\"aaaammjj\")","v":"20221218"},{"$f":"VLOOKUP(G14,'Listes déroulantes'!G:I,3,FALSE)","v":"60903600190001 "},"0000000000003200","978","2","IM ","S","           af2342567897","FAC",{"$f":"TEXT(E14,\"aaaammjj\")","v":"20221219"},{"$f":"VLOOKUP(G14,'Listes déroulantes'!G:O,9,FALSE)","v":"36 RUE DU TEST      "},"13","FRA",{"$f":"VLOOKUP(G14,'Listes déroulantes'!G:H,2,FALSE)","v":"CM_36               "},428648970577,"0045",1,"17028","92282",{"$f":"VLOOKUP(G14,'Listes déroulantes'!G:N,8,FALSE)","v":"28293060236"},"93","001","      ",{"$f":"VLOOKUP(G14,'Listes déroulantes'!G:J,4,FALSE)","v":"9556036   "},"   ","                                  ","EUR","02","0000000000003194","LMA-17028-I-2105-0009",{"$f":"VLOOKUP(G14,'Listes déroulantes'!G:M,7,FALSE)","v":"CM_36                   "},{"$f":"TEXT(E14,\"jjmmaa\")","v":"191222"},"000000","     ","0000000000003200","0000000000003200"," ","    ","        ","000000000000","000000000006"," ","00000","4643216546131356461",{"$f":"TEXT(E14,\"aaaammjj\")","v":"20221219"},"000009",{"$f":"IF(F14=\"CB\",(CONCATENATE(\"50003056125\",TEXT(E14-1,\"aammjj\"),\"0300    \")),\"002252                   \")","v":"500030561252212180300    "},"                                                                                                                                                                        ","000000000000","000000000000","    ","             ","                                                  ","20228380137          ","                                                                                                                                                                                                                            "]
["Enregistrement 8","oui","14000000X41702817028XACR1    090321702892282513264KHYODHNJ313182022121860903600190001 00000000000150259782IM V           af2342567898FAC2022121936 RUE DU TEST      13FRACM_36               4286489705780045117028922822829306023693001      9556036                                        EUR020000000000014995LMA-17028-I-2105-0010CM_36                   191222000000     00000000000150250000000000015025             000000000000000000000030 00000464321654613135646120221219000010002252                                                                                                                                                                                           000000000000000000000000","PaymentChargeback","2022-12-19","VISA","CM_36_PDPAG1",150.25,0,0.3,"0045","CRE 8","14","000000","X4","17028","17028","XA","CR1","    ","09","03","2","17028","92282","513264KHYODHNJ31318","20221218",{"$f":"VLOOKUP(G15,'Listes déroulantes'!G:I,3,FALSE)","v":"60903600190001 "},"0000000000015025","978","2","IM ","V","           af2342567898","FAC","20221219",{"$f":"VLOOKUP(G15,'Listes déroulantes'!G:O,9,FALSE)","v":"36 RUE DU TEST      "},"13","FRA",{"$f":"VLOOKUP(G15,'Listes déroulantes'!G:H,2,FALSE)","v":"CM_36               "},428648970578,"0045",1,"17028","92282",{"$f":"VLOOKUP(G15,'Listes déroulantes'!G:N,8,FALSE)","v":"28293060236"},"93","001","      ",{"$f":"VLOOKUP(G15,'Listes déroulantes'!G:J,4,FALSE)","v":"9556036   "},"   ","                                  ","EUR","02","0000000000014995","LMA-17028-I-2105-0010",{"$f":"VLOOKUP(G15,'Listes déroulantes'!G:M,7,FALSE)","v":"CM_36                   "},"191222","000000","     ","0000000000015025","0000000000015025"," ","    ","        ","000000000000","000000000030"," ","00000","4643216546131356461","20221219","000010",{"$f":"IF(F15=\"CB\",(CONCATENATE(\"50003056125\",TEXT(E15-1,\"aammjj\"),\"0300    \")),\"002252                   \")","v":"002252                   "},"                                                                                                                                                                        ","000000000000","000000000000","    ","             ","                                                  ","20228380138          ","                                                                                                                                                                                                                            "]
["Enregistrement 9","oui","14000000X51702817028XACR1    090321702892282513264KHYODHNJ313192022121860903600190001 00000000000240259782IM I           af2342567899FAC2022121936 RUE DU TEST      13FRACM_36               4286489705790045117028922822829306023693001      9556036                                        EUR020000000000023977LMA-17028-I-2105-0011CM_36                   191222000000     00000000000240250000000000024025             000000000000000000000048 00000464321654613135646120221219000011002252                                                                                                                                                                                           000000000000000000000000","PaymentChargeback","2022-12-19","MC","CM_36_PDPAG1",240.25,0,0.48,"0045","CRE 9","14","000000","X5","17028","17028","XA","CR1","    ","09","03","2","17028","92282","513264KHYODHNJ31319","20221218",{"$f":"VLOOKUP(G16,'Listes déroulantes'!G:I,3,FALSE)","v":"60903600190001 "},"0000000000024025","978","2","IM ","I","           af2342567899","FAC","20221219",{"$f":"VLOOKUP(G16,'Listes déroulantes'!G:O,9,FALSE)","v":"36 RUE DU TEST      "},"13","FRA",{"$f":"VLOOKUP(G16,'Listes déroulantes'!G:H,2,FALSE)","v":"CM_36               "},428648970579,"0045",1,"17028","92282",{"$f":"VLOOKUP(G16,'Listes déroulantes'!G:N,8,FALSE)","v":"28293060236"},"93","001","      ",{"$f":"VLOOKUP(G16,'Listes déroulantes'!G:J,4,FALSE)","v":"9556036   "},"   ","                                  ","EUR","02","0000000000023977","LMA-17028-I-2105-0011",{"$f":"VLOOKUP(G16,'Listes déroulantes'!G:M,7,FALSE)","v":"CM_36                   "},"191222","000000","     ","0000000000024025","0000000000024025"," ","    ","        ","000000000000","000000000048"," ","00000","4643216546131356461","20221219","000011","002252                   ","                                                                                                                                                                        ","000000000000","000000000000","    ","             ","                                                  ","20228380139          ","                                                                                                                                                                                                                            "]
["Enregistrement 10","oui","14000000Z11702817028XACR1    090321702892282513264KHYODHNJ313202022121860903700190001 00000000000150259782IM S           af2342567900FAC2022121937 RUE DU TEST      13FRACM_37               4286489705800045117028922822829306023793001      9556037                                        EUR020000000000014995LMA-17028-I-2105-0012CM_37                   191222000000     00000000000150250000000000015025             000000000000000000000030 00000464321654613135646120221219000012500030561252212180300                                                                                                                                                                            000000000000000000000000","PaymentChargeback","2022-12-19","CB","CM_37_VADAG1",150.25,0,0.3,"0045","CRE 10","14","000000","Z1","17028","17028","XA","CR1","    ","09","03","2","17028","92282","513264KHYODHNJ31320","20221218",{"$f":"VLOOKUP(G17,'Listes déroulantes'!G:I,3,FALSE)","v":"60903700190001 "},"0000000000015025","978","2","IM ","S","           af2342567900","FAC","20221219",{"$f":"VLOOKUP(G17,'Listes déroulantes'!G:O,9,FALSE)","v":"37 RUE DU TEST      "},"13","FRA",{"$f":"VLOOKUP(G17,'Listes déroulantes'!G:H,2,FALSE)","v":"CM_37               "},428648970580,"0045",1,"17028","92282",{"$f":"VLOOKUP(G17,'Listes déroulantes'!G:N,8,FALSE)","v":"28293060237"},"93","001","      ",{"$f":"VLOOKUP(G17,'Listes déroulantes'!G:J,4,FALSE)","v":"9556037   "},"   ","                                  ","EUR","02","0000000000014995","LMA-17028-I-2105-0012",{"$f":"VLOOKUP(G17,'Listes déroulantes'!G:M,7,FALSE)","v":"CM_37                   "},"191222","000000","     ","0000000000015025","0000000000015025"," ","    ","        ","000000000000","000000000030"," ","00000","4643216546131356461","20221219","000012","500030561252212180300    ","                                                                                                                                                                        ","000000000000","000000000000","    ","             ","                                                  ","20228380140          ","                                                                                                                                                                                                                            "]
["Enregistrement 11","oui","14000000X41702817028XACR1    090321702892282513264KHYODHNJ313212022121860903700190001 00000000000240259782IM V           af2342567901FAC2022121937 RUE DU TEST      13FRACM_37               4286489705810045117028922822829306023793001      9556037                                        EUR020000000000023977LMA-17028-I-2105-0013CM_37                   191222000000     00000000000240250000000000024025             000000000000000000000048 00000464321654613135646120221219000013002252                                                                                                                                                                                           000000000000000000000000","PaymentChargeback","2022-12-19","VISA","CM_37_VADAG1",240.25,0,0.48,"0045","CRE 11","14","000000","X4","17028","17028","XA","CR1","    ","09","03","2","17028","92282","513264KHYODHNJ31321","20221218",{"$f":"VLOOKUP(G18,'Listes déroulantes'!G:I,3,FALSE)","v":"60903700190001 "},"0000000000024025","978","2","IM ","V","           af2342567901","FAC","20221219",{"$f":"VLOOKUP(G18,'Listes déroulantes'!G:O,9,FALSE)","v":"37 RUE DU TEST      "},"13","FRA",{"$f":"VLOOKUP(G18,'Listes déroulantes'!G:H,2,FALSE)","v":"CM_37               "},428648970581,"0045",1,"17028","92282",{"$f":"VLOOKUP(G18,'Listes déroulantes'!G:N,8,FALSE)","v":"28293060237"},"93","001","      ",{"$f":"VLOOKUP(G18,'Listes déroulantes'!G:J,4,FALSE)","v":"9556037   "},"   ","                                  ","EUR","02","0000000000023977","LMA-17028-I-2105-0013",{"$f":"VLOOKUP(G18,'Listes déroulantes'!G:M,7,FALSE)","v":"CM_37                   "},"191222","000000","     ","0000000000024025","0000000000024025"," ","    ","        ","000000000000","000000000048"," ","00000","4643216546131356461","20221219","000013","002252                   ","                                                                                                                                                                        ","000000000000","000000000000","    ","             ","                                                  ","20228380141          ","                                                                                                                                                                                                                            "]
["Enregistrement 12","oui","14000000X51702817028XACR1    090321702892282513264KHYODHNJ313222022121860903700190001 00000000000015509782IM I           af2342567902FAC2022121937 RUE DU TEST      13FRACM_37               42864897058245  117028922822829306023793001      9556037                                        EUR020000000000001550LMA-17028-I-2105-0014CM_37                   191222000000     00000000000015500000000000001550             000000000000000000000000 00000464321654613135646120221219000014002252                                                                                                                                                                                           000000000000000000000000","PaymentChargeback","2022-12-19","MC","CM_37_VADAG1",15.5,0,0,"45  ","CRE 12","14","000000","X5","17028","17028","XA","CR1","    ","09","03","2","17028","92282","513264KHYODHNJ31322","20221218",{"$f":"VLOOKUP(G19,'Listes déroulantes'!G:I,3,FALSE)","v":"60903700190001 "},"0000000000001550","978","2","IM ","I","           af2342567902","FAC","20221219",{"$f":"VLOOKUP(G19,'Listes déroulantes'!G:O,9,FALSE)","v":"37 RUE DU TEST      "},"13","FRA",{"$f":"VLOOKUP(G19,'Listes déroulantes'!G:H,2,FALSE)","v":"CM_37               "},428648970582,"45  ",1,"17028","92282",{"$f":"VLOOKUP(G19,'Listes déroulantes'!G:N,8,FALSE)","v":"28293060237"},"93","001","      ",{"$f":"VLOOKUP(G19,'Listes déroulantes'!G:J,4,FALSE)","v":"9556037   "},"   ","                                  ","EUR","02","0000000000001550","LMA-17028-I-2105-0014",{"$f":"VLOOKUP(G19,'Listes déroulantes'!G:M,7,FALSE)","v":"CM_37                   "},"191222","000000","     ","0000000000001550","0000000000001550"," ","    ","        ","000000000000","000000000000"," ","00000","4643216546131356461","20221219","000014","002252                   ","                                                                                                                                                                        ","000000000000","000000000000","    ","             ","                                                  ","20228380142          ","                                                                                                                                                                                                                            "]
["Enregistrement 13","NON","CRE NON ACTIF","PaymentChargeback","2022-09-22","CB","CM_16_RMFEC VAD2",16,25,15,"45  ","CRE 13","14","000000","Z1","17028","17028","XA","CR1","    ","09","03","2","17028","92282","513264KHYODHNJ31323","20220921",{"$f":"VLOOKUP(G20,'Listes déroulantes'!G:I,3,FALSE)","v":"60929700180001 "},"0000000000001600","978","2","IM ","S","           af2342567903","FAC","20220922",{"$f":"VLOOKUP(G20,'Listes déroulantes'!G:O,9,FALSE)","v":"27 AVENUE DE LA CROI"},"13","FRA",{"$f":"VLOOKUP(G20,'Listes déroulantes'!G:H,2,FALSE)","v":"CM_16_RMFEC         "},428648970583,"45  ",1,"17028","92282",{"$f":"VLOOKUP(G20,'Listes déroulantes'!G:N,8,FALSE)","v":"28293060137"},"93","001","      ",{"$f":"VLOOKUP(G20,'Listes déroulantes'!G:J,4,FALSE)","v":"9256127   "},"   ","                                  ","EUR","02","0000000000000100","LMA-17028-I-2105-0015",{"$f":"VLOOKUP(G20,'Listes déroulantes'!G:M,7,FALSE)","v":"CM_16_RMFEC VAD         "},"220922","000000","     ","0000000000001600","0000000000001600"," ","    ","        ","000000000000","000000001500"," ","00000","4643216546131356461","20220922","000015","500030561252209210300    ","                                                                                                                                                                        ","000000002500","000000000000","    ","             ","                                                  ","20228380143          ","                                                                                                                                                                                                                            "]
["Enregistrement 14","NON","CRE NON ACTIF","PaymentChargeback","2022-09-22","CB","CM_16_RMFEC VAD2",16.5,25,0,"45  ","CRE 14","14","000000","Z1","17028","17028","XA","CR1","    ","09","03","2","17028","92282","513264KHYODHNJ31324","20220921",{"$f":"VLOOKUP(G21,'Listes déroulantes'!G:I,3,FALSE)","v":"60929700180001 "},"0000000000001650","978","2","IM ","S","           af2342567904","FAC","20220922",{"$f":"VLOOKUP(G21,'Listes déroulantes'!G:O,9,FALSE)","v":"27 AVENUE DE LA CROI"},"13","FRA",{"$f":"VLOOKUP(G21,'Listes déroulantes'!G:H,2,FALSE)","v":"CM_16_RMFEC         "},428648970584,"45  ",1,"17028","92282",{"$f":"VLOOKUP(G21,'Listes déroulantes'!G:N,8,FALSE)","v":"28293060137"},"93","001","      ",{"$f":"VLOOKUP(G21,'Listes déroulantes'!G:J,4,FALSE)","v":"9256127   "},"   ","                                  ","EUR","02","0000000000001650","LMA-17028-I-2105-0016",{"$f":"VLOOKUP(G21,'Listes déroulantes'!G:M,7,FALSE)","v":"CM_16_RMFEC VAD         "},"220922","000000","     ","0000000000001650","0000000000001650"," ","    ","        ","000000000000","000000000000"," ","00000","4643216546131356461","20220922","000016","500030561252209210300    ","                                                                                                                                                                        ","000000002500","000000000000","    ","             ","                                                  ","20228380144          ","                                                                                                                                                                                                                            "]
["Enregistrement 15","NON","CRE NON ACTIF","PaymentChargeback","2022-09-22","MC","SAS MONEXT PDP",244,25,1,"29","CRE 15","14","000000","X5","17028","17028","XA","CR1","    ","09","03","2","17028","92282","513264KHYODHNJ31325","20220921",{"$f":"VLOOKUP(G22,'Listes déroulantes'!G:I,3,FALSE)","v":"50318500100032 "},"0000000000024400","978","2","IM ","I","           af2342567905","FAC","20220922",{"$f":"VLOOKUP(G22,'Listes déroulantes'!G:O,9,FALSE)","v":"260 RUE CLAUDE NICOL"},"13","FRA",{"$f":"VLOOKUP(G22,'Listes déroulantes'!G:H,2,FALSE)","v":"SAS MONEXT          "},428648970585,"29",1,"17028","92282",{"$f":"VLOOKUP(G22,'Listes déroulantes'!G:N,8,FALSE)","v":"20289045644"},"93","001","      ",{"$f":"VLOOKUP(G22,'Listes déroulantes'!G:J,4,FALSE)","v":"9255001   "},"   ","                                  ","EUR","02","0000000000024300","LMA-17028-I-2105-0017",{"$f":"VLOOKUP(G22,'Listes déroulantes'!G:M,7,FALSE)","v":"MONEXT                  "},"220922","000000","     ","0000000000024400","0000000000024400"," ","    ","        ","000000000000","000000000100"," ","00000","4643216546131356461","20220922","000017","002252                   ","                                                                                                                                                                        ","000000002500","000000000000","    ","             ","                                                  ","20228380145          ","                                                                                                                                                                                                                            "]
["Enregistrement 16","NON","CRE NON ACTIF","PaymentChargeback","2022-09-22","MC","SAS MONEXT PDP",245,25,1,"30","CRE 16","14","000000","X5","17028","17028","XA","CR1","    ","09","03","2","17028","92282","513264KHYODHNJ31326","20220921",{"$f":"VLOOKUP(G23,'Listes déroulantes'!G:I,3,FALSE)","v":"50318500100032 "},"0000000000024500","978","2","IM ","I","           af2342567906","FAC","20220922",{"$f":"VLOOKUP(G23,'Listes déroulantes'!G:O,9,FALSE)","v":"260 RUE CLAUDE NICOL"},"13","FRA",{"$f":"VLOOKUP(G23,'Listes déroulantes'!G:H,2,FALSE)","v":"SAS MONEXT          "},428648970586,"30",1,"17028","92282",{"$f":"VLOOKUP(G23,'Listes déroulantes'!G:N,8,FALSE)","v":"20289045644"},"93","001","      ",{"$f":"VLOOKUP(G23,'Listes déroulantes'!G:J,4,FALSE)","v":"9255001   "},"   ","                                  ","EUR","02","0000000000024400","LMA-17028-I-2105-0018",{"$f":"VLOOKUP(G23,'Listes déroulantes'!G:M,7,FALSE)","v":"MONEXT                  "},"220922","000000","     ","0000000000024500","0000000000024500"," ","    ","        ","000000000000","000000000100"," ","00000","4643216546131356461","20220922","000018","002252                   ","                                                                                                                                                                        ","000000002500","000000000000","    ","             ","                                                  ","20228380146          ","                                                                                                                                                                                                                            "]
["Enregistrement 17","NON","CRE NON ACTIF","PaymentChargeback","2022-09-22","MC","SAS MONEXT PDP",246,25,1,"31","CRE 17","14","000000","X5","17028","17028","XA","CR1","    ","09","03","2","17028","92282","513264KHYODHNJ31327","20220921",{"$f":"VLOOKUP(G24,'Listes déroulantes'!G:I,3,FALSE)","v":"50318500100032 "},"0000000000024600","978","2","IM ","I","           af2342567907","FAC","20220922",{"$f":"VLOOKUP(G24,'Listes déroulantes'!G:O,9,FALSE)","v":"260 RUE CLAUDE NICOL"},"13","FRA",{"$f":"VLOOKUP(G24,'Listes déroulantes'!G:H,2,FALSE)","v":"SAS MONEXT          "},428648970587,"31",1,"17028","92282",{"$f":"VLOOKUP(G24,'Listes déroulantes'!G:N,8,FALSE)","v":"20289045644"},"93","001","      ",{"$f":"VLOOKUP(G24,'Listes déroulantes'!G:J,4,FALSE)","v":"9255001   "},"   ","                                  ","EUR","02","0000000000024500","LMA-17028-I-2105-0019",{"$f":"VLOOKUP(G24,'Listes déroulantes'!G:M,7,FALSE)","v":"MONEXT                  "},"220922","000000","     ","0000000000024600","0000000000024600"," ","    ","        ","000000000000","000000000100"," ","00000","4643216546131356461","20220922","000019","002252                   ","                                                                                                                                                                        ","000000002500","000000000000","    ","             ","                                                  ","20228380147          ","                                                                                                                                                                                                                            "]
["Enregistrement 18","NON","CRE NON ACTIF","PaymentChargeback","2022-09-22","MC","SAS MONEXT PDP",247,25,1,"32","CRE 18","14","000000","X5","17028","17028","XA","CR1","    ","09","03","2","17028","92282","513264KHYODHNJ31328","20220921",{"$f":"VLOOKUP(G25,'Listes déroulantes'!G:I,3,FALSE)","v":"50318500100032 "},"0000000000024700","978","2","IM ","I","           af2342567908","FAC","20220922",{"$f":"VLOOKUP(G25,'Listes déroulantes'!G:O,9,FALSE)","v":"260 RUE CLAUDE NICOL"},"13","FRA",{"$f":"VLOOKUP(G25,'Listes déroulantes'!G:H,2,FALSE)","v":"SAS MONEXT          "},428648970588,"32",1,"17028","92282",{"$f":"VLOOKUP(G25,'Listes déroulantes'!G:N,8,FALSE)","v":"20289045644"},"93","001","      ",{"$f":"VLOOKUP(G25,'Listes déroulantes'!G:J,4,FALSE)","v":"9255001   "},"   ","                                  ","EUR","02","0000000000024600","LMA-17028-I-2105-0020",{"$f":"VLOOKUP(G25,'Listes déroulantes'!G:M,7,FALSE)","v":"MONEXT                  "},"220922","000000","     ","0000000000024700","0000000000024700"," ","    ","        ","000000000000","000000000100"," ","00000","4643216546131356461","20220922","000020","002252                   ","                                                                                                                                                                        ","000000002500","000000000000","    ","             ","                                                  ","20228380148          ","                                                                                                                                                                                                                            "]
["Enregistrement 19","NON","CRE NON ACTIF","PaymentChargeback","2022-09-22","MC","SAS MONEXT PDP",248,25,1,"33","CRE 19","14","000000","X5","17028","17028","XA","CR1","    ","09","03","2","17028","92282","513264KHYODHNJ31329","20220921",{"$f":"VLOOKUP(G26,'Listes déroulantes'!G:I,3,FALSE)","v":"50318500100032 "},"0000000000024800","978","2","IM ","I","           af2342567909","FAC","20220922",{"$f":"VLOOKUP(G26,'Listes déroulantes'!G:O,9,FALSE)","v":"260 RUE CLAUDE NICOL"},"13","FRA",{"$f":"VLOOKUP(G26,'Listes déroulantes'!G:H,2,FALSE)","v":"SAS MONEXT          "},428648970589,"33",1,"17028","92282",{"$f":"VLOOKUP(G26,'Listes déroulantes'!G:N,8,FALSE)","v":"20289045644"},"93","001","      ",{"$f":"VLOOKUP(G26,'Listes déroulantes'!G:J,4,FALSE)","v":"9255001   "},"   ","                                  ","EUR","02","0000000000024700","LMA-17028-I-2105-0021",{"$f":"VLOOKUP(G26,'Listes déroulantes'!G:M,7,FALSE)","v":"MONEXT                  "},"220922","000000","     ","0000000000024800","0000000000024800"," ","    ","        ","000000000000","000000000100"," ","00000","4643216546131356461","20220922","000021","002252                   ","                                                                                                                                                                        ","000000002500","000000000000","    ","             ","                                                  ","20228380149          ","                                                                                                                                                                                                                            "]
["Enregistrement 20","NON","CRE NON ACTIF","PaymentChargeback","2022-09-22","MC","SAS MONEXT PDP",249,25,1,"34","CRE 20","14","000000","X5","17028","17028","XA","CR1","    ","09","03","2","17028","92282","513264KHYODHNJ31330","20220921",{"$f":"VLOOKUP(G27,'Listes déroulantes'!G:I,3,FALSE)","v":"50318500100032 "},"0000000000024900","978","2","IM ","I","           af2342567910","FAC","20220922",{"$f":"VLOOKUP(G27,'Listes déroulantes'!G:O,9,FALSE)","v":"260 RUE CLAUDE NICOL"},"13","FRA",{"$f":"VLOOKUP(G27,'Listes déroulantes'!G:H,2,FALSE)","v":"SAS MONEXT          "},428648970590,"34",1,"17028","92282",{"$f":"VLOOKUP(G27,'Listes déroulantes'!G:N,8,FALSE)","v":"20289045644"},"93","001","      ",{"$f":"VLOOKUP(G27,'Listes déroulantes'!G:J,4,FALSE)","v":"9255001   "},"   ","                                  ","EUR","02","0000000000024800","LMA-17028-I-2105-0022",{"$f":"VLOOKUP(G27,'Listes déroulantes'!G:M,7,FALSE)","v":"MONEXT                  "},"220922","000000","     ","0000000000024900","0000000000024900"," ","    ","        ","000000000000","000000000100"," ","00000","4643216546131356461","20220922","000022","002252                   ","                                                                                                                                                                        ","000000002500","000000000000","    ","             ","                                                  ","20228380150          ","                                                                                                                                                                                                                            "]
["Enregistrement 21","NON","CRE NON ACTIF","PaymentChargeback","2022-09-22","MC","SAS MONEXT PDP",250,25,1,"35","CRE 21","14","000000","X5","17028","17028","XA","CR1","    ","09","03","2","17028","92282","513264KHYODHNJ31331","20220921",{"$f":"VLOOKUP(G28,'Listes déroulantes'!G:I,3,FALSE)","v":"50318500100032 "},"0000000000025000","978","2","IM ","I","           af2342567911","FAC","20220922",{"$f":"VLOOKUP(G28,'Listes déroulantes'!G:O,9,FALSE)","v":"260 RUE CLAUDE NICOL"},"13","FRA",{"$f":"VLOOKUP(G28,'Listes déroulantes'!G:H,2,FALSE)","v":"SAS MONEXT          "},428648970591,"35",1,"17028","92282",{"$f":"VLOOKUP(G28,'Listes déroulantes'!G:N,8,FALSE)","v":"20289045644"},"93","001","      ",{"$f":"VLOOKUP(G28,'Listes déroulantes'!G:J,4,FALSE)","v":"9255001   "},"   ","                                  ","EUR","02","0000000000024900","LMA-17028-I-2105-0023",{"$f":"VLOOKUP(G28,'Listes déroulantes'!G:M,7,FALSE)","v":"MONEXT                  "},"220922","000000","     ","0000000000025000","0000000000025000"," ","    ","        ","000000000000","000000000100"," ","00000","4643216546131356461","20220922","000023","002252                   ","                                                                                                                                                                        ","000000002500","000000000000","    ","             ","                                                  ","20228380151          ","                                                                                                                                                                                                                            "]
["Enregistrement 22","NON",{"$f":"IF(B31=\"OUI\",CONCATENATE(M29,N29,O29,P29,Q29,R29,S29,T29,U29,V29,W29,X29,Y29,Z29,AA29,AB29,AC29,AD29,AE29,AF29,AG29,AH29,AI29,AJ29,AK29,AL29,AM29,AN29,AO29,AP29,AQ29,AR29,AS29,AT29,AU29,AV29,AW29,AX29,AY29,AZ29,BA29,BB29,BC29,BD29,BE29,BF29,BG29,BH29,BI29,BJ29,BK29,BL29,BM29,BN29,BO29,BP29,BQ29,BR29,BS29,BT29,BU29,BV29,BW29,BX29),\"CRE NON ACTIF\")","v":"CRE NON ACTIF"},"RefundChargeback","2022-09-22","VISA","CM_12_RMFEC VAD",12,0,0,"73  ","CRE 22","14","000000","X4","17028","17028","XA","CR1","    ","09","03","2","17028","92282","513264KHYODHNJ31332","20220921",{"$f":"VLOOKUP(G29,'Listes déroulantes'!G:I,3,FALSE)","v":"60925700180001 "},"0000000000001200","978","2","IM ","V","           af2342567912","AVO","20220922",{"$f":"VLOOKUP(G29,'Listes déroulantes'!G:O,9,FALSE)","v":"8 RUE LOUBET        "},"13","FRA",{"$f":"VLOOKUP(G29,'Listes déroulantes'!G:H,2,FALSE)","v":"CM_12_RMFEC         "},428648970592,"73  ",1,"17028","92282",{"$f":"VLOOKUP(G29,'Listes déroulantes'!G:N,8,FALSE)","v":"28293060134"},"93","001","      ",{"$f":"VLOOKUP(G29,'Listes déroulantes'!G:J,4,FALSE)","v":"9256020   "},"   ","                                  ","EUR","02","0000000000001200","LMA-17028-I-2105-0024",{"$f":"VLOOKUP(G29,'Listes déroulantes'!G:M,7,FALSE)","v":"CM_12_RMFEC VAD         "},"220922","000000","     ","0000000000001200","0000000000001200"," ","    ","        ","000000000000","000000000000"," ","00000","4643216546131356461","20220922","000024","002252                   ","                                                                                                                                                                        ","000000000000","000000000000","    ","             ","                                                  ","20228380152          ","                                                                                                                                                                                                                            "]
["Enregistrement 23","NON","CRE NON ACTIF","RefundChargeback","2022-09-22","VISA","CM_22  VAD                         ",33,0,0,"73  ","CRE 23","14","000000","X4","17028","17028","XA","CR1","    ","09","03","2","17028","92282","513264KHYODHNJ31333","20220921",{"$f":"VLOOKUP(G30,'Listes déroulantes'!G:I,3,FALSE)","v":"60934700180001 "},"0000000000003300","978","2","IM ","V","           af2342567913","AVO","20220922",{"$f":"VLOOKUP(G30,'Listes déroulantes'!G:O,9,FALSE)","v":"22 RUE DES FLEURS   "},"13","FRA",{"$f":"VLOOKUP(G30,'Listes déroulantes'!G:H,2,FALSE)","v":"CM_22               "},428648970593,"73  ",1,"17028","92282",{"$f":"VLOOKUP(G30,'Listes déroulantes'!G:N,8,FALSE)","v":"28293060142"},"93","001","      ",{"$f":"VLOOKUP(G30,'Listes déroulantes'!G:J,4,FALSE)","v":"9256033   "},"   ","                                  ","EUR","02","0000000000003300","LMA-17028-I-2105-0025",{"$f":"VLOOKUP(G30,'Listes déroulantes'!G:M,7,FALSE)","v":"CM_22                   "},"220922","000000","     ","0000000000003300","0000000000003300"," ","    ","        ","000000000000","000000000000"," ","00000","4643216546131356461","20220922","000025","002252                   ","                                                                                                                                                                        ","000000000000","000000000000","    ","             ","                                                  ","20228380153          ","                                                                                                                                                                                                                            "]
["Enregistrement 24","NON","CRE NON ACTIF","RefundChargeback","2022-09-22","MC","CM_20  VAD                         ",25,0,0,"4853","CRE 24","14","000000","X5","17028","17028","XA","CR1","    ","09","03","2","17028","92282","513264KHYODHNJ31334","20220921",{"$f":"VLOOKUP(G31,'Listes déroulantes'!G:I,3,FALSE)","v":"60932700180001 "},"0000000000002500","978","2","IM ","I","           af2342567914","AVO","20220922",{"$f":"VLOOKUP(G31,'Listes déroulantes'!G:O,9,FALSE)","v":"20 RUE DES FLEURS   "},"13","FRA",{"$f":"VLOOKUP(G31,'Listes déroulantes'!G:H,2,FALSE)","v":"CM_20               "},428648970594,"4853",1,"17028","92282",{"$f":"VLOOKUP(G31,'Listes déroulantes'!G:N,8,FALSE)","v":"28293060140"},"93","001","      ",{"$f":"VLOOKUP(G31,'Listes déroulantes'!G:J,4,FALSE)","v":"9256031   "},"   ","                                  ","EUR","02","0000000000002500","LMA-17028-I-2105-0026",{"$f":"VLOOKUP(G31,'Listes déroulantes'!G:M,7,FALSE)","v":"CM_20                   "},"220922","000000","     ","0000000000002500","0000000000002500"," ","    ","        ","000000000000","000000000000"," ","00000","4643216546131356461","20220922","000026","002252                   ","                                                                                                                                                                        ","000000000000","000000000000","    ","             ","                                                  ","20228380154          ","                                                                                                                                                                                                                            "]
["Enregistrement 25","NON","CRE NON ACTIF","RefundChargeback","2022-09-22","MC","CM_23  VAD                       ",15,0,0,"4853","CRE 25","14","000000","X5","17028","17028","XA","CR1","    ","09","03","2","17028","92282","513264KHYODHNJ31335","20220921",{"$f":"VLOOKUP(G32,'Listes déroulantes'!G:I,3,FALSE)","v":"60935700180001 "},"0000000000001500","978","2","IM ","I","           af2342567915","AVO","20220922",{"$f":"VLOOKUP(G32,'Listes déroulantes'!G:O,9,FALSE)","v":"23 RUE DES FLEURS   "},"13","FRA",{"$f":"VLOOKUP(G32,'Listes déroulantes'!G:H,2,FALSE)","v":"CM_23               "},428648970595,"4853",1,"17028","92282",{"$f":"VLOOKUP(G32,'Listes déroulantes'!G:N,8,FALSE)","v":"28293060143"},"93","001","      ",{"$f":"VLOOKUP(G32,'Listes déroulantes'!G:J,4,FALSE)","v":"9256034   "},"   ","                                  ","EUR","02","0000000000001500","LMA-17028-I-2105-0027",{"$f":"VLOOKUP(G32,'Listes déroulantes'!G:M,7,FALSE)","v":"CM_23                   "},"220922","000000","     ","0000000000001500","0000000000001500"," ","    ","        ","000000000000","000000000000"," ","00000","4643216546131356461","20220922","000027","002252                   ","                                                                                                                                                                        ","000000000000","000000000000","    ","             ","                                                  ","20228380155          ","                                                                                                                                                                                                                            "]
["Enregistrement 26","NON","CRE NON ACTIF","RefundChargeback","2022-09-22","MC","CM_24b  VAD                       ",20,0,0,"4853","CRE 26","14","000000","X5","17028","17028","XA","CR1","    ","09","03","2","17028","92282","513264KHYODHNJ31336","20220921",{"$f":"VLOOKUP(G33,'Listes déroulantes'!G:I,3,FALSE)","v":{"$error":"#N/A"}},"0000000000002000","978","2","IM ","I","           af2342567916","AVO","20220922",{"$f":"VLOOKUP(G33,'Listes déroulantes'!G:O,9,FALSE)","v":{"$error":"#N/A"}},"13","FRA",{"$f":"VLOOKUP(G33,'Listes déroulantes'!G:H,2,FALSE)","v":{"$error":"#N/A"}},428648970596,{"$f":"K33","v":"4853"},1,"17028","92282",{"$f":"VLOOKUP(G33,'Listes déroulantes'!G:N,8,FALSE)","v":{"$error":"#N/A"}},"93","001","      ",{"$f":"VLOOKUP(G33,'Listes déroulantes'!G:J,4,FALSE)","v":{"$error":"#N/A"}},"   ","                                  ","EUR","02","0000000000002000","LMA-17028-I-2105-0028",{"$f":"VLOOKUP(G33,'Listes déroulantes'!G:M,7,FALSE)","v":{"$error":"#N/A"}},"220922","000000","     ","0000000000002000","0000000000002000"," ","    ","        ","000000000000","000000000000"," ","00000","4643216546131356461","20220922","000028","002252                   ","                                                                                                                                                                        ","000000000000","000000000000","    ","             ","                                                  ","20228380156          ","                                                                                                                                                                                                                            "]
["Enregistrement 27","NON","CRE NON ACTIF","RefundChargeback","2022-09-22","CB","CM_12_RMFEC VAD",50,0,0.1,"0045","CRE 27","14","000000","Z1","17028","17028","XA","CR1","    ","09","03","2","17028","92282","513264KHYODHNJ31337","20220921",{"$f":"VLOOKUP(G34,'Listes déroulantes'!G:I,3,FALSE)","v":"60925700180001 "},"0000000000005000","978","2","IM ","S","           af2342567917","AVO","20220922",{"$f":"VLOOKUP(G34,'Listes déroulantes'!G:O,9,FALSE)","v":"8 RUE LOUBET        "},"13","FRA",{"$f":"VLOOKUP(G34,'Listes déroulantes'!G:H,2,FALSE)","v":"CM_12_RMFEC         "},428648970597,"0045",1,"17028","92282",{"$f":"VLOOKUP(G34,'Listes déroulantes'!G:N,8,FALSE)","v":"28293060134"},"93","001","      ",{"$f":"VLOOKUP(G34,'Listes déroulantes'!G:J,4,FALSE)","v":"9256020   "},"   ","                                  ","EUR","02","0000000000004990","LMA-17028-I-2105-0029",{"$f":"VLOOKUP(G34,'Listes déroulantes'!G:M,7,FALSE)","v":"CM_12_RMFEC VAD         "},"220922","000000","     ","0000000000005000","0000000000005000"," ","    ","        ","000000000000","000000000010"," ","00000","4643216546131356461","20220922","000029","500030561252209210300    ","                                                                                                                                                                        ","000000000000","000000000000","    ","             ","                                                  ","20228380157          ","                                                                                                                                                                                                                            "]
["Enregistrement 28","NON","CRE NON ACTIF","RefundChargeback","2022-09-22","CB","CM_14_RMFEC VAD",22.5,0,0.05,"0045","CRE 28","14","000000","Z1","17028","17028","XA","CR1","    ","09","03","2","17028","92282","513264KHYODHNJ31338","20220921",{"$f":"VLOOKUP(G35,'Listes déroulantes'!G:I,3,FALSE)","v":"60927700180001 "},"0000000000002250","978","2","IM ","S","           af2342567918","AVO","20220922",{"$f":"VLOOKUP(G35,'Listes déroulantes'!G:O,9,FALSE)","v":"132 RUE VINCENT EUVR"},"13","FRA",{"$f":"VLOOKUP(G35,'Listes déroulantes'!G:H,2,FALSE)","v":"CM_14_RMFEC         "},428648970598,"0045",1,"17028","92282",{"$f":"VLOOKUP(G35,'Listes déroulantes'!G:N,8,FALSE)","v":"28293060135"},"93","001","      ",{"$f":"VLOOKUP(G35,'Listes déroulantes'!G:J,4,FALSE)","v":"9256024   "},"   ","                                  ","EUR","02","0000000000002245","LMA-17028-I-2105-0030",{"$f":"VLOOKUP(G35,'Listes déroulantes'!G:M,7,FALSE)","v":"CM_14_RMFEC VAD         "},"220922","000000","     ","0000000000002250","0000000000002250"," ","    ","        ","000000000000","000000000005"," ","00000","4643216546131356461","20220922","000030","500030561252209210300    ","                                                                                                                                                                        ","000000000000","000000000000","    ","             ","                                                  ","20228380158          ","                                                                                                                                                                                                                            "]
["Enregistrement 29","NON","CRE NON ACTIF","RefundChargeback","2022-09-22","CB","CM_24b  VAD                       ",22.5,0,0.05,"0045","CRE 29","14","000000","Z1","17028","17028","XA","CR1","    ","09","03","2","17028","92282","513264KHYODHNJ31339","20220921",{"$f":"VLOOKUP(G36,'Listes déroulantes'!G:I,3,FALSE)","v":{"$error":"#N/A"}},"0000000000002250","978","2","IM ","S","           af2342567919","AVO","20220922",{"$f":"VLOOKUP(G36,'Listes déroulantes'!G:O,9,FALSE)","v":{"$error":"#N/A"}},"13","FRA",{"$f":"VLOOKUP(G36,'Listes déroulantes'!G:H,2,FALSE)","v":{"$error":"#N/A"}},428648970599,"0045",1,"17028","92282",{"$f":"VLOOKUP(G36,'Listes déroulantes'!G:N,8,FALSE)","v":{"$error":"#N/A"}},"93","001","      ",{"$f":"VLOOKUP(G36,'Listes déroulantes'!G:J,4,FALSE)","v":{"$error":"#N/A"}},"   ","                                  ","EUR","02","0000000000002245","LMA-17028-I-2105-0031",{"$f":"VLOOKUP(G36,'Listes déroulantes'!G:M,7,FALSE)","v":{"$error":"#N/A"}},"220922","000000","     ","0000000000002250","0000000000002250"," ","    ","        ","000000000000","000000000005"," ","00000","4643216546131356461","20220922","000031","500030561252209210300    ","                                                                                                                                                                        ","000000000000","000000000000","    ","             ","                                                  ","20228380159          ","                                                                                                                                                                                                                            "]
["Enregistrement 30","NON","CRE NON ACTIF","RefundChargeback","2022-06-13","MC","SAS MONEXT PDP",259,25,1,"44","CRE 30","14","000000","X5","17028","17028","XA","CR1","    ","09","03","2","17028","92282","513264KHYODHNJ31340","20220612",{"$f":"VLOOKUP(G37,'Listes déroulantes'!G:I,3,FALSE)","v":"50318500100032 "},"0000000000025900","978","2","IM ","I","           af2342567920","AVO","20220613",{"$f":"VLOOKUP(G37,'Listes déroulantes'!G:O,9,FALSE)","v":"260 RUE CLAUDE NICOL"},"13","FRA",{"$f":"VLOOKUP(G37,'Listes déroulantes'!G:H,2,FALSE)","v":"SAS MONEXT          "},428648970600,"44",1,"17028","92282",{"$f":"VLOOKUP(G37,'Listes déroulantes'!G:N,8,FALSE)","v":"20289045644"},"93","001","      ",{"$f":"VLOOKUP(G37,'Listes déroulantes'!G:J,4,FALSE)","v":"9255001   "},"   ","                                  ","EUR","02","0000000000025800","LMA-17028-I-2105-0032",{"$f":"VLOOKUP(G37,'Listes déroulantes'!G:M,7,FALSE)","v":"MONEXT                  "},"130622","000000","     ","0000000000025900","0000000000025900"," ","    ","        ","000000000000","000000000100"," ","00000","4643216546131356461","20220613","000032","002252                   ","                                                                                                                                                                        ","000000002500","000000000000","    ","             ","                                                  ","20228380160          ","                                                                                                                                                                                                                            "]
["Enregistrement 31","NON","CRE NON ACTIF","RefundChargeback","2021-06-22","MC","SAS MONEXT PDP",260,25,1,"45","CRE 31","14","000000","X5","17028","17028","XA","CR1","    ","09","03","2","17028","92282","513264KHYODHNJ31341","20210621",{"$f":"VLOOKUP(G38,'Listes déroulantes'!G:I,3,FALSE)","v":"50318500100032 "},"0000000000026000","978","2","IM ","I","           af2342567921","AVO","20210622",{"$f":"VLOOKUP(G38,'Listes déroulantes'!G:O,9,FALSE)","v":"260 RUE CLAUDE NICOL"},"13","FRA",{"$f":"VLOOKUP(G38,'Listes déroulantes'!G:H,2,FALSE)","v":"SAS MONEXT          "},428648970601,"45",1,"17028","92282",{"$f":"VLOOKUP(G38,'Listes déroulantes'!G:N,8,FALSE)","v":"20289045644"},"93","001","      ",{"$f":"VLOOKUP(G38,'Listes déroulantes'!G:J,4,FALSE)","v":"9255001   "},"   ","                                  ","EUR","02","0000000000025900","LMA-17028-I-2105-0033",{"$f":"VLOOKUP(G38,'Listes déroulantes'!G:M,7,FALSE)","v":"MONEXT                  "},"220621","000000","     ","0000000000026000","0000000000026000"," ","    ","        ","000000000000","000000000100"," ","00000","4643216546131356461","20210622","000033","002252                   ","                                                                                                                                                                        ","000000002500","000000000000","    ","             ","                                                  ","20228380161          ","                                                                                                                                                                                                                            "]
["Enregistrement 32","NON","CRE NON ACTIF","RefundChargeback","2021-06-22","MC","SAS MONEXT PDP",261,25,1,"46","CRE 32","14","000000","X5","17028","17028","XA","CR1","    ","09","03","2","17028","92282","513264KHYODHNJ31342","20210621",{"$f":"VLOOKUP(G39,'Listes déroulantes'!G:I,3,FALSE)","v":"50318500100032 "},"0000000000026100","978","2","IM ","I","           af2342567922","AVO","20210622",{"$f":"VLOOKUP(G39,'Listes déroulantes'!G:O,9,FALSE)","v":"260 RUE CLAUDE NICOL"},"13","FRA",{"$f":"VLOOKUP(G39,'Listes déroulantes'!G:H,2,FALSE)","v":"SAS MONEXT          "},428648970602,"46",1,"17028","92282",{"$f":"VLOOKUP(G39,'Listes déroulantes'!G:N,8,FALSE)","v":"20289045644"},"93","001","      ",{"$f":"VLOOKUP(G39,'Listes déroulantes'!G:J,4,FALSE)","v":"9255001   "},"   ","                                  ","EUR","02","0000000000026000","LMA-17028-I-2105-0034",{"$f":"VLOOKUP(G39,'Listes déroulantes'!G:M,7,FALSE)","v":"MONEXT                  "},"220621","000000","     ","0000000000026100","0000000000026100"," ","    ","        ","000000000000","000000000100"," ","00000","4643216546131356461","20210622","000034","002252                   ","                                                                                                                                                                        ","000000002500","000000000000","    ","             ","                                                  ","20228380162          ","                                                                                                                                                                                                                            "]
["Enregistrement 33","NON","CRE NON ACTIF","RefundChargeback","2021-06-22","MC","SAS MONEXT PDP",262,25,1,"47","CRE 33","14","000000","X5","17028","17028","XA","CR1","    ","09","03","2","17028","92282","513264KHYODHNJ31343","20210621",{"$f":"VLOOKUP(G40,'Listes déroulantes'!G:I,3,FALSE)","v":"50318500100032 "},"0000000000026200","978","2","IM ","I","           af2342567923","AVO","20210622",{"$f":"VLOOKUP(G40,'Listes déroulantes'!G:O,9,FALSE)","v":"260 RUE CLAUDE NICOL"},"13","FRA",{"$f":"VLOOKUP(G40,'Listes déroulantes'!G:H,2,FALSE)","v":"SAS MONEXT          "},428648970603,"47",1,"17028","92282",{"$f":"VLOOKUP(G40,'Listes déroulantes'!G:N,8,FALSE)","v":"20289045644"},"93","001","      ",{"$f":"VLOOKUP(G40,'Listes déroulantes'!G:J,4,FALSE)","v":"9255001   "},"   ","                                  ","EUR","02","0000000000026100","LMA-17028-I-2105-0035",{"$f":"VLOOKUP(G40,'Listes déroulantes'!G:M,7,FALSE)","v":"MONEXT                  "},"220621","000000","     ","0000000000026200","0000000000026200"," ","    ","        ","000000000000","000000000100"," ","00000","4643216546131356461","20210622","000035","002252                   ","                                                                                                                                                                        ","000000002500","000000000000","    ","             ","                                                  ","20228380163          ","                                                                                                                                                                                                                            "]
["Enregistrement 34","NON","CRE NON ACTIF","RefundChargeback","2021-06-22","MC","SAS MONEXT PDP",263,25,1,"48","CRE 34","14","000000","X5","17028","17028","XA","CR1","    ","09","03","2","17028","92282","513264KHYODHNJ31344","20210621",{"$f":"VLOOKUP(G41,'Listes déroulantes'!G:I,3,FALSE)","v":"50318500100032 "},"0000000000026300","978","2","IM ","I","           af2342567924","AVO","20210622",{"$f":"VLOOKUP(G41,'Listes déroulantes'!G:O,9,FALSE)","v":"260 RUE CLAUDE NICOL"},"13","FRA",{"$f":"VLOOKUP(G41,'Listes déroulantes'!G:H,2,FALSE)","v":"SAS MONEXT          "},428648970604,"48",1,"17028","92282",{"$f":"VLOOKUP(G41,'Listes déroulantes'!G:N,8,FALSE)","v":"20289045644"},"93","001","      ",{"$f":"VLOOKUP(G41,'Listes déroulantes'!G:J,4,FALSE)","v":"9255001   "},"   ","                                  ","EUR","02","0000000000026200","LMA-17028-I-2105-0036",{"$f":"VLOOKUP(G41,'Listes déroulantes'!G:M,7,FALSE)","v":"MONEXT                  "},"220621","000000","     ","0000000000026300","0000000000026300"," ","    ","        ","000000000000","000000000100"," ","00000","4643216546131356461","20210622","000036","002252                   ","                                                                                                                                                                        ","000000002500","000000000000","    ","             ","                                                  ","20228380164          ","                                                                                                                                                                                                                            "]
["Enregistrement 35","NON","CRE NON ACTIF","RefundChargeback","2021-06-22","MC","SAS MONEXT PDP",264,25,1,"49","CRE 35","14","000000","X5","17028","17028","XA","CR1","    ","09","03","2","17028","92282","513264KHYODHNJ31345","20210621",{"$f":"VLOOKUP(G42,'Listes déroulantes'!G:I,3,FALSE)","v":"50318500100032 "},"0000000000026400","978","2","IM ","I","           af2342567925","AVO","20210622",{"$f":"VLOOKUP(G42,'Listes déroulantes'!G:O,9,FALSE)","v":"260 RUE CLAUDE NICOL"},"13","FRA",{"$f":"VLOOKUP(G42,'Listes déroulantes'!G:H,2,FALSE)","v":"SAS MONEXT          "},428648970605,"49",1,"17028","92282",{"$f":"VLOOKUP(G42,'Listes déroulantes'!G:N,8,FALSE)","v":"20289045644"},"93","001","      ",{"$f":"VLOOKUP(G42,'Listes déroulantes'!G:J,4,FALSE)","v":"9255001   "},"   ","                                  ","EUR","02","0000000000026300","LMA-17028-I-2105-0037",{"$f":"VLOOKUP(G42,'Listes déroulantes'!G:M,7,FALSE)","v":"MONEXT                  "},"220621","000000","     ","0000000000026400","0000000000026400"," ","    ","        ","000000000000","000000000100"," ","00000","4643216546131356461","20210622","000037","002252                   ","                                                                                                                                                                        ","000000002500","000000000000","    ","             ","                                                  ","20228380165          ","                                                                                                                                                                                                                            "]
["Enregistrement 36","NON","CRE NON ACTIF","RefundChargeback","2021-06-22","MC","SAS MONEXT PDP",265,25,1,"50","CRE 36","14","000000","X5","17028","17028","XA","CR1","    ","09","03","2","17028","92282","513264KHYODHNJ31346","20210621",{"$f":"VLOOKUP(G43,'Listes déroulantes'!G:I,3,FALSE)","v":"50318500100032 "},"0000000000026500","978","2","IM ","I","           af2342567926","AVO","20210622",{"$f":"VLOOKUP(G43,'Listes déroulantes'!G:O,9,FALSE)","v":"260 RUE CLAUDE NICOL"},"13","FRA",{"$f":"VLOOKUP(G43,'Listes déroulantes'!G:H,2,FALSE)","v":"SAS MONEXT          "},428648970606,"50",1,"17028","92282",{"$f":"VLOOKUP(G43,'Listes déroulantes'!G:N,8,FALSE)","v":"20289045644"},"93","001","      ",{"$f":"VLOOKUP(G43,'Listes déroulantes'!G:J,4,FALSE)","v":"9255001   "},"   ","                                  ","EUR","02","0000000000026400","LMA-17028-I-2105-0038",{"$f":"VLOOKUP(G43,'Listes déroulantes'!G:M,7,FALSE)","v":"MONEXT                  "},"220621","000000","     ","0000000000026500","0000000000026500"," ","    ","        ","000000000000","000000000100"," ","00000","4643216546131356461","20210622","000038","002252                   ","                                                                                                                                                                        ","000000002500","000000000000","    ","             ","                                                  ","20228380166          ","                                                                                                                                                                                                                            "]
["Enregistrement 37","NON","CRE NON ACTIF","RefundChargeback","2021-06-22","MC","SAS MONEXT PDP",266,25,1,"51","CRE 37","14","000000","X5","17028","17028","XA","CR1","    ","09","03","2","17028","92282","513264KHYODHNJ31347","20210621",{"$f":"VLOOKUP(G44,'Listes déroulantes'!G:I,3,FALSE)","v":"50318500100032 "},"0000000000026600","978","2","IM ","I","           af2342567927","AVO","20210622",{"$f":"VLOOKUP(G44,'Listes déroulantes'!G:O,9,FALSE)","v":"260 RUE CLAUDE NICOL"},"13","FRA",{"$f":"VLOOKUP(G44,'Listes déroulantes'!G:H,2,FALSE)","v":"SAS MONEXT          "},428648970607,"51",1,"17028","92282",{"$f":"VLOOKUP(G44,'Listes déroulantes'!G:N,8,FALSE)","v":"20289045644"},"93","001","      ",{"$f":"VLOOKUP(G44,'Listes déroulantes'!G:J,4,FALSE)","v":"9255001   "},"   ","                                  ","EUR","02","0000000000026500","LMA-17028-I-2105-0039",{"$f":"VLOOKUP(G44,'Listes déroulantes'!G:M,7,FALSE)","v":"MONEXT                  "},"220621","000000","     ","0000000000026600","0000000000026600"," ","    ","        ","000000000000","000000000100"," ","00000","4643216546131356461","20210622","000039","002252                   ","                                                                                                                                                                        ","000000002500","000000000000","    ","             ","                                                  ","20228380167          ","                                                                                                                                                                                                                            "]
["Enregistrement 38","NON","CRE NON ACTIF","RefundChargeback","2021-06-22","MC","SAS MONEXT PDP",267,25,1,"52","CRE 38","14","000000","X5","17028","17028","XA","CR1","    ","09","03","2","17028","92282","513264KHYODHNJ31348","20210621",{"$f":"VLOOKUP(G45,'Listes déroulantes'!G:I,3,FALSE)","v":"50318500100032 "},"0000000000026700","978","2","IM ","I","           af2342567928","AVO","20210622",{"$f":"VLOOKUP(G45,'Listes déroulantes'!G:O,9,FALSE)","v":"260 RUE CLAUDE NICOL"},"13","FRA",{"$f":"VLOOKUP(G45,'Listes déroulantes'!G:H,2,FALSE)","v":"SAS MONEXT          "},428648970608,"52",1,"17028","92282",{"$f":"VLOOKUP(G45,'Listes déroulantes'!G:N,8,FALSE)","v":"20289045644"},"93","001","      ",{"$f":"VLOOKUP(G45,'Listes déroulantes'!G:J,4,FALSE)","v":"9255001   "},"   ","                                  ","EUR","02","0000000000026600","LMA-17028-I-2105-0040",{"$f":"VLOOKUP(G45,'Listes déroulantes'!G:M,7,FALSE)","v":"MONEXT                  "},"220621","000000","     ","0000000000026700","0000000000026700"," ","    ","        ","000000000000","000000000100"," ","00000","4643216546131356461","20210622","000040","002252                   ","                                                                                                                                                                        ","000000002500","000000000000","    ","             ","                                                  ","20228380168          ","                                                                                                                                                                                                                            "]
["Enregistrement 39","NON","CRE NON ACTIF","RefundChargeback","2021-06-22","MC","SAS MONEXT PDP",268,25,1,"53","CRE 39","14","000000","X5","17028","17028","XA","CR1","    ","09","03","2","17028","92282","513264KHYODHNJ31349","20210621",{"$f":"VLOOKUP(G46,'Listes déroulantes'!G:I,3,FALSE)","v":"50318500100032 "},"0000000000026800","978","2","IM ","I","           af2342567929","AVO","20210622",{"$f":"VLOOKUP(G46,'Listes déroulantes'!G:O,9,FALSE)","v":"260 RUE CLAUDE NICOL"},"13","FRA",{"$f":"VLOOKUP(G46,'Listes déroulantes'!G:H,2,FALSE)","v":"SAS MONEXT          "},428648970609,"53",1,"17028","92282",{"$f":"VLOOKUP(G46,'Listes déroulantes'!G:N,8,FALSE)","v":"20289045644"},"93","001","      ",{"$f":"VLOOKUP(G46,'Listes déroulantes'!G:J,4,FALSE)","v":"9255001   "},"   ","                                  ","EUR","02","0000000000026700","LMA-17028-I-2105-0041",{"$f":"VLOOKUP(G46,'Listes déroulantes'!G:M,7,FALSE)","v":"MONEXT                  "},"220621","000000","     ","0000000000026800","0000000000026800"," ","    ","        ","000000000000","000000000100"," ","00000","4643216546131356461","20210622","000041","002252                   ","                                                                                                                                                                        ","000000002500","000000000000","    ","             ","                                                  ","20228380169          ","                                                                                                                                                                                                                            "]
["Enregistrement 40","NON","CRE NON ACTIF","RefundChargeback","2021-06-22","MC","SAS MONEXT PDP",269,25,1,"54","CRE 40","14","000000","X5","17028","17028","XA","CR1","    ","09","03","2","17028","92282","513264KHYODHNJ31350","20210621",{"$f":"VLOOKUP(G47,'Listes déroulantes'!G:I,3,FALSE)","v":"50318500100032 "},"0000000000026900","978","2","IM ","I","           af2342567930","AVO","20210622",{"$f":"VLOOKUP(G47,'Listes déroulantes'!G:O,9,FALSE)","v":"260 RUE CLAUDE NICOL"},"13","FRA",{"$f":"VLOOKUP(G47,'Listes déroulantes'!G:H,2,FALSE)","v":"SAS MONEXT          "},428648970610,"54",1,"17028","92282",{"$f":"VLOOKUP(G47,'Listes déroulantes'!G:N,8,FALSE)","v":"20289045644"},"93","001","      ",{"$f":"VLOOKUP(G47,'Listes déroulantes'!G:J,4,FALSE)","v":"9255001   "},"   ","                                  ","EUR","02","0000000000026800","LMA-17028-I-2105-0042",{"$f":"VLOOKUP(G47,'Listes déroulantes'!G:M,7,FALSE)","v":"MONEXT                  "},"220621","000000","     ","0000000000026900","0000000000026900"," ","    ","        ","000000000000","000000000100"," ","00000","4643216546131356461","20210622","000042","002252                   ","                                                                                                                                                                        ","000000002500","000000000000","    ","             ","                                                  ","20228380170          ","                                                                                                                                                                                                                            "]
["Enregistrement 41","NON","CRE NON ACTIF","RefundChargeback","2021-06-22","MC","SAS MONEXT PDP",270,25,1,"55","CRE 41","14","000000","X5","17028","17028","XA","CR1","    ","09","03","2","17028","92282","513264KHYODHNJ31351","20210621",{"$f":"VLOOKUP(G48,'Listes déroulantes'!G:I,3,FALSE)","v":"50318500100032 "},"0000000000027000","978","2","IM ","I","           af2342567931","AVO","20210622",{"$f":"VLOOKUP(G48,'Listes déroulantes'!G:O,9,FALSE)","v":"260 RUE CLAUDE NICOL"},"13","FRA",{"$f":"VLOOKUP(G48,'Listes déroulantes'!G:H,2,FALSE)","v":"SAS MONEXT          "},428648970611,"55",1,"17028","92282",{"$f":"VLOOKUP(G48,'Listes déroulantes'!G:N,8,FALSE)","v":"20289045644"},"93","001","      ",{"$f":"VLOOKUP(G48,'Listes déroulantes'!G:J,4,FALSE)","v":"9255001   "},"   ","                                  ","EUR","02","0000000000026900","LMA-17028-I-2105-0043",{"$f":"VLOOKUP(G48,'Listes déroulantes'!G:M,7,FALSE)","v":"MONEXT                  "},"220621","000000","     ","0000000000027000","0000000000027000"," ","    ","        ","000000000000","000000000100"," ","00000","4643216546131356461","20210622","000043","002252                   ","                                                                                                                                                                        ","000000002500","000000000000","    ","             ","                                                  ","20228380171          ","                                                                                                                                                                                                                            "]
[]
[]
[null,null,null,null,null,null,null,null,null,null,null,null,null,null,null,null,null,null,null,null,null,null,null,null,null,null,null,null,null,null,null,null,null,null,null,null,null,null,null,null,null,null,null,null,null,null,null,null,null,null,null,null,null,null,null,null,null,null,null,null,null,null,null,null,null,null,null,null,null,null,null,null,null,null,null,{"$f":"LEN(BX8)","v":12}]
[]
[null,null,null,null,null,null,null,null,null,null,null,null,null,null,null,null,null,null,null,null,null,null,null,null,null,null,null,null,null,null,null,null,null,null,null,null,null,null,null,null,null,null,null,null,null,null,null,null,null,null,null,null,null,null,null,null,null,null,null,null,null,null,null,null,null,null,null,null,null,null,null,null,{"$f":"LEN(BU14)","v":25}]

{"sheet":"Création CRE IMP RT","index":5,"n_rows":48,"n_cols":76,"rows_kept":48,"cut":false,"hidden":false,"merged":[[0,0,0,3]]}
["CRE CONCATENE (données de sortie)",null,null,null,"DONNEES PARAMETRABLES",null,null,null,null,null,null,null,"CRE DECOUPE (détails intermédiaires)"]
[null,null,null,null,null,null,null,null,null,null,null,"Début",1,3,9,11,16,21,23,26,30,32,34,35,40,45,64,72,87,103,106,107,110,111,134,137,145,165,167,170,190,202,206,207,212,217,228,230,233,239,249,252,286,289,291,307,328,352,358,364,369,385,401,402,406,414,426,438,439,444,463,471,477,502,670,682]
[null,null,null,null,null,null,null,null,null,null,null,"Lg",2,6,2,5,5,2,3,4,2,2,1,5,5,19,8,15,16,3,1,3,1,23,3,8,20,2,3,20,12,4,1,5,5,11,2,3,6,10,3,34,3,2,16,21,24,6,6,5,16,16,1,4,8,12,12,1,5,19,8,6,25,168,12,320]
[null,null,null,null,null,null,null,null,null,null,null,"Specification","‘14’ ",0,"Domestique :  « Z4 » : Décisions émises\nMasterCard : « X1 » : Décisions émises\nVisa : « X2 » : Décisions émises\n\n","Code banque de domiciliation du porteur","Code banque de domiciliation du commerçant","‘XA’ Impayé RT","RP1 Repr Impayé « 100 », « 102 » \nAR1 annulation représenattion si S04 = « 400 », « 402 »\nIC1 : Imputation commerçant \nAI1 : Annulation imputation commerçant \nPPT : perte et profit si imputation banque (un autre CRE)","Spaces","? Spec en écart avec observation de prod ","? Spec en écart avec observation de prod ","? Spec en écart avec observation de prod ","Code établissement gestionnaire de l’acquéreur","CDGUICH de l’impayé","Numéro de carte porteur de l'impayé : si généré en 16 caractères alors paddé à droite avec les espaces \nPAN est tokénisé ","Date de vente (SSAAMMJJ) pour une transaction de litige\nDate de remise pour une remise de paiement ou de retrait","SIRET de l’impayé","Montant brut en centimes correspondant à l’opération de :\n'- CR1 : Impayé (ou AOCT impayé) du montant brut de l’impayé partiel ou total reçu \n'- RP1 : Représentation ou AOCT de représentation  montant brut de la représentation (correspondant au montant total ou partiel de l’impayé reçu)\n'- IC1 : Imputation commerçant è montant brut  de l’impayé partiel ou total reçu \n'- PPT : Perte et profit du montant brut  de l’impayé partiel ou total reçu\n'- AI1 : Annulation imputation commerçant du montant brut de l’impayé partiel ou total reçu ","\"978\"","Nombre de décimales du montant  brut","? Spec en écart avec observation de prod ","Code réseau de l'impayé","NUARN de l’impayé","FAC = 100 ou 402\nAVO = 102 ou 400","Selon le réseau au format SSAAMMJJ","LILOCA de l’impayé","CDDEPT de l’impayé","CDPAYS de l’impayé","RAISOA de l’impayé","NURFI2 de l’impayé","Motif de l’impayé dans la codification du format de compensation reçu","1 : first chargeback  2 : second chargeback","Code banque issu du référentiel commerçant par rapport au SIRET","Code siège du RIB issu du référentiel commerçant par rapport au SIRET","Numéro de compte du RIB issu du référentiel commerçant par rapport au SIRET  ","Clé RIB calculée (YD04-CLRIBA)\nen se servant des informations issues du référentiel commerçant par rapport au SIRET ","Numéro de terminal pour une remise commerçant","spaces","NUMCO de l'impayé","Code ICA de l’impayé reçu","A blanc pour l’instant","Devise du montant compensé de l’impayé reçu en code ISO 3166-1 ","NB décimale du montant compensé de l’impayé reçu","Montant compensé de l’impayé reçu","ex : LMA-16638-I-1911-0009",null,"Format : JJMMAA","Donnée uniquement pour les remises commerçant ou retrait","Donnée uniquement pour les remises commerçant ou retrait","Donnée uniquement pour les remises commerçant ou retrait","Montant brut en euro","Code usage","Indique si le litige est géré dans LMA ou dans un outil réseau (VROL pour Visa)\n« LMA » si géré dans LMA\n« RSX » si géré dans les outils Réseaux (VROL pour Visa)","DTCERE de la transaction mis sous le format ssaammjj (non rempli pour imp)","Pas de comm commerçant ","Différence entre (montant brut en euro et montant compensé) sur 2 décimales","spaces","Code établissement gestionnaire de l’acquéreur","numéro de carte porteur : si généré du 16 caractères, complété par des blancs","Date d’enregistrement de la transaction dans les tables au format SSAAMMJJ ","Numéro attribué à l’impayé : ce numéro est crée par LMA lors de la prise en compte de l’impayé","Identifiant de remise issue de l’header CB2C",null,"Correspond au montant des frais d'impayé parametré dans la grille tarifiare du commerçant et alimenté par le module tarifiare. 2 décimales"]
[null,null,null,null,null,null,null,null,null,null,null,"Libellé","Code type d’enregistrement","Numéro séquentiel","Code opération","Code banque émetteur","Code banque destinataire","Code application échange","Code sous application",null,"Code origine flux","Code destination flux","Code nature de flux comptable","Code établissement","Guichet accepteur","Numéro de carte","Date de vente","SIRET","Montant brut","Devise de réconciliation nationale liée au montant brut","Nombre de décimales du montant brut","Type opération","Code réseau","Référence archivage","Code opération interne","Date de règlement interbancaire","Localisation","Code département","Code pays","Raison sociale","Référence impayé reçue","Motif impayé","Code cycle impayé","Code établissement du RIB","Code Guichet du RIB ","Numéro de compte","Clé RIB","Numéro de terminal","Filler","Numéro de contrat accepteur","Code ICA","IBAN","Devise du montant compensé","nombre décimal mt compensé","Montant compensé","Référence externe","Nom du commerçant","Date de Valeur","Nombre de factures","Numéro de remise","Montant net","Montant brut en euro","Code usage","Mode de Traitement du Litige","Date envoi en compensation","Montant commission commerçant ","Montant commission Interchange","Type de porteur","code établissement","Numéro de carte","Date archivage","Numéro séquentiel","Identifiant de Remise","FILLER","Montant Frais d'impayé","FILLER"]
["Mode d'alimentation de ce fichier",null,"Généré automatiquement, nb de ligne voulu à copier coller dans Notepad)","Fixe","Variable à saisir JJ/MM/AAAA","Variable liste déroulante","Variable liste déroulante","Variable à saisir 0,00","Variable à saisir 0,00","Variable à saisir 0,00","Variable à saisir","Mode d'alimentation de ce fichier","FIXE","FIXE","FIXE","FIXE","FIXE","FIXE","FIXE","FIXE","FIXE","FIXE","FIXE","FIXE","FIXE","FIXE","DEDUITE","DEDUITE","DEDUITE","FIXE","FIXE","FIXE","FIXE","FIXE","FIXE","DEDUITE","FIXE","FIXE","FIXE","DEDUITE","FIXE","FIXE","FIXE","FIXE","FIXE","DEDUITE","DEDUITE","FIXE","FIXE","DEDUITE","FIXE","FIXE","FIXE","FIXE","DEDUITE","FIXE","DEDUITE","DEDUITE","FIXE","FIXE","DEDUITE","DEDUITE","FIXE","FIXE","DEDUITE","DEDUITE",null,"FIXE","FIXE","DEDUITE","FIXE","FIXE","FIXE","FIXE","DEDUITE","FIXE"]
["CRE concerné","CRE ACTIF","CRE concaténé","Opération (CDOPEI)","Date de valeur de l'impayé (DTVAL)","Réseau (IDSCPT)","Commerçant","Montant Brut impayé","Montant Frais rejet à rembourser","Montant interchange (non facturée au client) (MTINTVMC)","Code motif impayé","Code","CEENR","NUSQC","CEOPE","CEEMI","CEDES","CEAPC","CEMAP","FILLER","CECFTO","CECFTD","CDNAFL","CDETB9","CDGUICH","NUISOA","DTVEN","ZSIRET","MTBRUT","CDDEV","NBDEC","TYPOPE","IDSPCT","NUARN","CDOPEI","DTREGLI","LILOCA","CDDEPT","CDPAYS","RAISOA","NURFI2","COANO","COCYIM","CEETRX","CEGUIX","NUCTEA","CLRIBX","NUTP","Filler","NUMCO","CDICA","CDIBAN","CDDEVC","NBDECC","MTCOMP","REFEXT","NMCM","DTVL","NBFCT","NUREM","MTNT","MTBREUR","DSPUSG","MDTRLT","DTCOMP","MTTTCITR","MTCOMINT","TYPO","CDETB9","NUISOA","DTARCH","NUSDI","IDREM","FILLER1","FRAISIMP","FILLER"]
["Enregistrement 1","OUI",{"$f":"IF(B8=\"OUI\",CONCATENATE(M8,N8,O8,P8,Q8,R8,S8,T8,U8,V8,W8,X8,Y8,Z8,AA8,AB8,AC8,AD8,AE8,AF8,AG8,AH8,AI8,AJ8,AK8,AL8,AM8,AN8,AO8,AP8,AQ8,AR8,AS8,AT8,AU8,AV8,AW8,AX8,AY8,AZ8,BA8,BB8,BC8,BD8,BE8,BF8,BG8,BH8,BI8,BJ8,BK8,BL8,BM8,BN8,BO8,BP8,BQ8,BR8,BS8,BT8,BU8,BV8,BW8,BX8),\"CRE NON ACTIF\")","v":"14000000Z41702817028XAPPT    030731702892282513264KHYODHNJ313112022092160925700180001 00000000000025009782IM S           af2342567891FAC202209228 RUE LOUBET        13FRACM_12_RMFEC         4286489705710045117028922822829306013493001      9256020                                        EUR020000000000002495LMA-17028-I-2105-0003CM_12_RMFEC VAD         220922000000     00000000000025000000000000002500             000000000000000000000005 00000464321654613135646120220922000003                                                                                                                                                                                                 000000000500                                                                                                                                                                                                                                                                                                                                "},"Impayés imputables Monext","2022-09-22","CB","CM_12_RMFEC VAD",25,5,0.05,"0045","CRE 1","14","000000",{"$f":"IF(F8=\"CB\",\"Z4\",IF(F8=\"MC\",\"X1\",\"X2\"))","v":"Z4"},"17028","17028","XA","PPT","    ","03","07",3,"17028","92282","513264KHYODHNJ31311",{"$f":"TEXT(E8-1,\"aaaammjj\")","v":"20220921"},{"$f":"VLOOKUP(G8,'Listes déroulantes'!G:I,3,FALSE)","v":"60925700180001 "},{"$f":"RIGHT(CONCATENATE(\"0000000000000000\",H8*100),16)","v":"0000000000002500"},"978","2","IM ",{"$f":"IF(F8=\"CB\",\"S\",IF(F8=\"MC\",\"I\",\"V\"))","v":"S"},"           af2342567891","FAC",{"$f":"TEXT(E8,\"aaaammjj\")","v":"20220922"},{"$f":"VLOOKUP(G8,'Listes déroulantes'!G:O,9,FALSE)","v":"8 RUE LOUBET        "},"13","FRA",{"$f":"VLOOKUP(G8,'Listes déroulantes'!G:H,2,FALSE)","v":"CM_12_RMFEC         "},428648970571,{"$f":"K8","v":"0045"},1,"17028","92282",{"$f":"VLOOKUP(G8,'Listes déroulantes'!G:N,8,FALSE)","v":"28293060134"},"93","001","      ",{"$f":"VLOOKUP(G8,'Listes déroulantes'!G:J,4,FALSE)","v":"9256020   "},"   ","                                  ","EUR","02",{"$f":"RIGHT(CONCATENATE(\"0000000000000000\",(H8-J8)*100),16)","v":"0000000000002495"},"LMA-17028-I-2105-0003",{"$f":"VLOOKUP(G8,'Listes déroulantes'!G:M,7,FALSE)","v":"CM_12_RMFEC VAD         "},{"$f":"TEXT(E8,\"jjmmaa\")","v":"220922"},"000000","     ",{"$f":"RIGHT(CONCATENATE(\"0000000000000000\",H8*100),16)","v":"0000000000002500"},{"$f":"RIGHT(CONCATENATE(\"0000000000000000\",H8*100),16)","v":"0000000000002500"}," ","    ","        ","000000000000",{"$f":"RIGHT(CONCATENATE(\"0000000000000000\",J8*100),12)","v":"000000000005"}," ","00000","4643216546131356461",{"$f":"TEXT(E8,\"aaaammjj\")","v":"20220922"},"000003",{"$f":"\"                         \"","v":"                         "},"                                                                                                                                                                        ",{"$f":"RIGHT(CONCATENATE(\"0000000000000000\",I8*100),12)","v":"000000000500"},"                                                                                                                                                                                                                                                                                                                                "]
["Enregistrement 2","OUI",{"$f":"IF(B9=\"OUI\",CONCATENATE(M9,N9,O9,P9,Q9,R9,S9,T9,U9,V9,W9,X9,Y9,Z9,AA9,AB9,AC9,AD9,AE9,AF9,AG9,AH9,AI9,AJ9,AK9,AL9,AM9,AN9,AO9,AP9,AQ9,AR9,AS9,AT9,AU9,AV9,AW9,AX9,AY9,AZ9,BA9,BB9,BC9,BD9,BE9,BF9,BG9,BH9,BI9,BJ9,BK9,BL9,BM9,BN9,BO9,BP9,BQ9,BR9,BS9,BT9,BU9,BV9,BW9,BX9),\"CRE NON ACTIF\")","v":"14000000Z41702817028XAPPT    030731702892282513264KHYODHNJ313122022092160923700180001 00000000000018009782IM S           af2342567892FAC202209221 RUE AUDE          13FRACM_10_RMFEC         4286489705720045117028922822829306013293001      9256017                                        EUR020000000000001796LMA-17028-I-2105-0004CM_10_RMFEC VAD         220922000000     00000000000018000000000000001800             000000000000000000000004 00000464321654613135646120220922000004                                                                                                                                                                                                 000000000000                                                                                                                                                                                                                                                                                                                                "},"Impayés imputables Monext","2022-09-22","CB","CM_10_RMFEC VAD",18,0,0.04,"0045","CRE 2","14","000000",{"$f":"IF(F9=\"CB\",\"Z4\",IF(F9=\"MC\",\"X1\",\"X2\"))","v":"Z4"},"17028","17028","XA","PPT","    ","03","07",3,"17028","92282","513264KHYODHNJ31312",{"$f":"TEXT(E9-1,\"aaaammjj\")","v":"20220921"},{"$f":"VLOOKUP(G9,'Listes déroulantes'!G:I,3,FALSE)","v":"60923700180001 "},"0000000000001800","978","2","IM ",{"$f":"IF(F9=\"CB\",\"S\",IF(F9=\"MC\",\"I\",\"V\"))","v":"S"},"           af2342567892","FAC","20220922",{"$f":"VLOOKUP(G9,'Listes déroulantes'!G:O,9,FALSE)","v":"1 RUE AUDE          "},"13","FRA",{"$f":"VLOOKUP(G9,'Listes déroulantes'!G:H,2,FALSE)","v":"CM_10_RMFEC         "},428648970572,{"$f":"K9","v":"0045"},1,"17028","92282",{"$f":"VLOOKUP(G9,'Listes déroulantes'!G:N,8,FALSE)","v":"28293060132"},"93","001","      ",{"$f":"VLOOKUP(G9,'Listes déroulantes'!G:J,4,FALSE)","v":"9256017   "},"   ","                                  ","EUR","02","0000000000001796","LMA-17028-I-2105-0004",{"$f":"VLOOKUP(G9,'Listes déroulantes'!G:M,7,FALSE)","v":"CM_10_RMFEC VAD         "},"220922","000000","     ",{"$f":"RIGHT(CONCATENATE(\"0000000000000000\",H9*100),16)","v":"0000000000001800"},"0000000000001800"," ","    ","        ","000000000000",{"$f":"RIGHT(CONCATENATE(\"0000000000000000\",J9*100),12)","v":"000000000004"}," ","00000","4643216546131356461","20220922","000004",{"$f":"\"                         \"","v":"                         "},"                                                                                                                                                                        ",{"$f":"RIGHT(CONCATENATE(\"0000000000000000\",I9*100),12)","v":"000000000000"},"                                                                                                                                                                                                                                                                                                                                "]
["Enregistrement 3","OUI",{"$f":"IF(B10=\"OUI\",CONCATENATE(M10,N10,O10,P10,Q10,R10,S10,T10,U10,V10,W10,X10,Y10,Z10,AA10,AB10,AC10,AD10,AE10,AF10,AG10,AH10,AI10,AJ10,AK10,AL10,AM10,AN10,AO10,AP10,AQ10,AR10,AS10,AT10,AU10,AV10,AW10,AX10,AY10,AZ10,BA10,BB10,BC10,BD10,BE10,BF10,BG10,BH10,BI10,BJ10,BK10,BL10,BM10,BN10,BO10,BP10,BQ10,BR10,BS10,BT10,BU10,BV10,BW10,BX10),\"CRE NON ACTIF\")","v":"14000000Z41702817028XAPPT    030731702892282513264KHYODHNJ313132022092160923700180001 00000000000032009782IM S           af2342567893FAC202209221 RUE AUDE          13FRACM_10_RMFEC         4286489705730045117028922822829306013293001      9256017                                        EUR020000000000003194LMA-17028-I-2105-0005CM_10_RMFEC VAD         220922000000     00000000000032000000000000003200             000000000000000000000006 00000464321654613135646120220922000005                                                                                                                                                                                                 000000000000                                                                                                                                                                                                                                                                                                                                "},"Impayés imputables Monext","2022-09-22","CB","CM_10_RMFEC VAD",32,0,0.06,"0045","CRE 3","14","000000","Z4","17028","17028","XA","PPT","    ","03","07",3,"17028","92282","513264KHYODHNJ31313","20220921",{"$f":"VLOOKUP(G10,'Listes déroulantes'!G:I,3,FALSE)","v":"60923700180001 "},"0000000000003200","978","2","IM ","S","           af2342567893","FAC","20220922",{"$f":"VLOOKUP(G10,'Listes déroulantes'!G:O,9,FALSE)","v":"1 RUE AUDE          "},"13","FRA",{"$f":"VLOOKUP(G10,'Listes déroulantes'!G:H,2,FALSE)","v":"CM_10_RMFEC         "},428648970573,"0045",1,"17028","92282",{"$f":"VLOOKUP(G10,'Listes déroulantes'!G:N,8,FALSE)","v":"28293060132"},"93","001","      ",{"$f":"VLOOKUP(G10,'Listes déroulantes'!G:J,4,FALSE)","v":"9256017   "},"   ","                                  ","EUR","02","0000000000003194","LMA-17028-I-2105-0005",{"$f":"VLOOKUP(G10,'Listes déroulantes'!G:M,7,FALSE)","v":"CM_10_RMFEC VAD         "},"220922","000000","     ","0000000000003200","0000000000003200"," ","    ","        ","000000000000","000000000006"," ","00000","4643216546131356461","20220922","000005","                         ","                                                                                                                                                                        ","000000000000","                                                                                                                                                                                                                                                                                                                                "]
["Enregistrement 4","NON","CRE NON ACTIF","Impayés imputables Monext","2022-01-19","CB","CM_21  VAD                       ",22.11,2.11,0,"45  ","CRE 4","14","000000","Z4","17028","17028","XA","PPT","    ","03","07",3,"17028","92282","513264KHYODHNJ31314","20220118",{"$f":"VLOOKUP(G11,'Listes déroulantes'!G:I,3,FALSE)","v":"60933700180001 "},"0000000000002211","978","2","IM ","S","           af2342567894","FAC","20220119",{"$f":"VLOOKUP(G11,'Listes déroulantes'!G:O,9,FALSE)","v":"21 RUE DES FLEURS   "},"13","FRA",{"$f":"VLOOKUP(G11,'Listes déroulantes'!G:H,2,FALSE)","v":"CM_21               "},428648970574,"45  ",1,"17028","92282",{"$f":"VLOOKUP(G11,'Listes déroulantes'!G:N,8,FALSE)","v":"28293060141"},"93","001","      ",{"$f":"VLOOKUP(G11,'Listes déroulantes'!G:J,4,FALSE)","v":"9256032   "},"   ","                                  ","EUR","02","0000000000002211","LMA-17028-I-2105-0006",{"$f":"VLOOKUP(G11,'Listes déroulantes'!G:M,7,FALSE)","v":"CM_21                   "},"190122","000000","     ","0000000000002211","0000000000002211"," ","    ","        ","000000000000","000000000000"," ","00000","4643216546131356461","20220119","000006","                         ","                                                                                                                                                                        ","000000000211","                                                                                                                                                                                                                                                                                                                                "]
["Enregistrement 5","NON","CRE NON ACTIF","Impayés imputables Monext","2022-01-19","CB","CM_22  VAD                         ",77.77,23,0.09,"45  ","CRE 5","14","000000","Z4","17028","17028","XA","PPT","    ","03","07",3,"17028","92282","513264KHYODHNJ31315","20220118",{"$f":"VLOOKUP(G12,'Listes déroulantes'!G:I,3,FALSE)","v":"60934700180001 "},"0000000000007777","978","2","IM ","S","           af2342567895","FAC","20220119",{"$f":"VLOOKUP(G12,'Listes déroulantes'!G:O,9,FALSE)","v":"22 RUE DES FLEURS   "},"13","FRA",{"$f":"VLOOKUP(G12,'Listes déroulantes'!G:H,2,FALSE)","v":"CM_22               "},428648970575,"45  ",1,"17028","92282",{"$f":"VLOOKUP(G12,'Listes déroulantes'!G:N,8,FALSE)","v":"28293060142"},"93","001","      ",{"$f":"VLOOKUP(G12,'Listes déroulantes'!G:J,4,FALSE)","v":"9256033   "},"   ","                                  ","EUR","02","0000000000007768","LMA-17028-I-2105-0007",{"$f":"VLOOKUP(G12,'Listes déroulantes'!G:M,7,FALSE)","v":"CM_22                   "},"190122","000000","     ","0000000000007777","0000000000007777"," ","    ","        ","000000000000","000000000009"," ","00000","4643216546131356461","20220119","000007","                         ","                                                                                                                                                                        ","000000002300","                                                                                                                                                                                                                                                                                                                                "]
["Enregistrement 6","NON","CRE NON ACTIF","Impayés imputables Monext","2022-01-19","CB","CM_12_RMFEC VAD",26,18,0,4853,"CRE 6","14","000000","Z4","17028","17028","XA","PPT","    ","03","07",3,"17028","92282","513264KHYODHNJ31316","20220118",{"$f":"VLOOKUP(G13,'Listes déroulantes'!G:I,3,FALSE)","v":"60925700180001 "},"0000000000002600","978","2","IM ","S","           af2342567896","FAC","20220119",{"$f":"VLOOKUP(G13,'Listes déroulantes'!G:O,9,FALSE)","v":"8 RUE LOUBET        "},"13","FRA",{"$f":"VLOOKUP(G13,'Listes déroulantes'!G:H,2,FALSE)","v":"CM_12_RMFEC         "},428648970576,4853,1,"17028","92282",{"$f":"VLOOKUP(G13,'Listes déroulantes'!G:N,8,FALSE)","v":"28293060134"},"93","001","      ",{"$f":"VLOOKUP(G13,'Listes déroulantes'!G:J,4,FALSE)","v":"9256020   "},"   ","                                  ","EUR","02","0000000000002600","LMA-17028-I-2105-0008",{"$f":"VLOOKUP(G13,'Listes déroulantes'!G:M,7,FALSE)","v":"CM_12_RMFEC VAD         "},"190122","000000","     ","0000000000002600","0000000000002600"," ","    ","        ","000000000000","000000000000"," ","00000","4643216546131356461","20220119","000008","                         ","                                                                                                                                                                        ","000000001800","                                                                                                                                                                                                                                                                                                                                "]
["Enregistrement 7","NON","CRE NON ACTIF","Impayés imputables Monext","2021-10-21","CB","CM_16_RMFEC PDPSC",13.1,25,1,"45  ","CRE 7","14","000000","Z4","17028","17028","XA","PPT","    ","03","07",3,"17028","92282","513264KHYODHNJ31317","20211020",{"$f":"VLOOKUP(G14,'Listes déroulantes'!G:I,3,FALSE)","v":"60929700180001 "},"0000000000001310","978","2","IM ","S","           af2342567897","FAC","20211021",{"$f":"VLOOKUP(G14,'Listes déroulantes'!G:O,9,FALSE)","v":"27 AVENUE DE LA CROI"},"13","FRA",{"$f":"VLOOKUP(G14,'Listes déroulantes'!G:H,2,FALSE)","v":"CM_16_RMFEC         "},428648970577,"45  ",1,"17028","92282",{"$f":"VLOOKUP(G14,'Listes déroulantes'!G:N,8,FALSE)","v":"28293060137"},"93","001","      ",{"$f":"VLOOKUP(G14,'Listes déroulantes'!G:J,4,FALSE)","v":"9256026   "},"   ","                                  ","EUR","02","0000000000001210","LMA-17028-I-2105-0009",{"$f":"VLOOKUP(G14,'Listes déroulantes'!G:M,7,FALSE)","v":"CM_16_RMFEC PDPSC       "},"211021","000000","     ","0000000000001310","0000000000001310"," ","    ","        ","000000000000","000000000100"," ","00000","4643216546131356461","20211021","000009","                         ","                                                                                                                                                                        ","000000002500","                                                                                                                                                                                                                                                                                                                                "]
["Enregistrement 8","NON","CRE NON ACTIF","Impayés imputables Monext","2021-10-21","CB","CM_16_RMFEC PDPSC",13.2,25,0,"45  ","CRE 8","14","000000","Z4","17028","17028","XA","PPT","    ","03","07",3,"17028","92282","513264KHYODHNJ31318","20211020",{"$f":"VLOOKUP(G15,'Listes déroulantes'!G:I,3,FALSE)","v":"60929700180001 "},"0000000000001320","978","2","IM ","S","           af2342567898","FAC","20211021",{"$f":"VLOOKUP(G15,'Listes déroulantes'!G:O,9,FALSE)","v":"27 AVENUE DE LA CROI"},"13","FRA",{"$f":"VLOOKUP(G15,'Listes déroulantes'!G:H,2,FALSE)","v":"CM_16_RMFEC         "},428648970578,"45  ",1,"17028","92282",{"$f":"VLOOKUP(G15,'Listes déroulantes'!G:N,8,FALSE)","v":"28293060137"},"93","001","      ",{"$f":"VLOOKUP(G15,'Listes déroulantes'!G:J,4,FALSE)","v":"9256026   "},"   ","                                  ","EUR","02","0000000000001320","LMA-17028-I-2105-0010",{"$f":"VLOOKUP(G15,'Listes déroulantes'!G:M,7,FALSE)","v":"CM_16_RMFEC PDPSC       "},"211021","000000","     ","0000000000001320","0000000000001320"," ","    ","        ","000000000000","000000000000"," ","00000","4643216546131356461","20211021","000010","                         ","                                                                                                                                                                        ","000000002500","                                                                                                                                                                                                                                                                                                                                "]
["Enregistrement 9","NON","CRE NON ACTIF","Impayés imputables Monext","2021-10-21","VISA","CM_16_RMFEC PDP ",14.1,25,1,"0073","CRE 9","14","000000","X2","17028","17028","XA","PPT","    ","03","07",3,"17028","92282","513264KHYODHNJ31319","20211020",{"$f":"VLOOKUP(G16,'Listes déroulantes'!G:I,3,FALSE)","v":"60929700180001 "},"0000000000001410","978","2","IM ","V","           af2342567899","FAC","20211021",{"$f":"VLOOKUP(G16,'Listes déroulantes'!G:O,9,FALSE)","v":"27 AVENUE DE LA CROI"},"13","FRA",{"$f":"VLOOKUP(G16,'Listes déroulantes'!G:H,2,FALSE)","v":"CM_16_RMFEC         "},428648970579,"0073",1,"17028","92282",{"$f":"VLOOKUP(G16,'Listes déroulantes'!G:N,8,FALSE)","v":"28293060137"},"93","001","      ",{"$f":"VLOOKUP(G16,'Listes déroulantes'!G:J,4,FALSE)","v":"9256026   "},"   ","                                  ","EUR","02","0000000000001310","LMA-17028-I-2105-0011",{"$f":"VLOOKUP(G16,'Listes déroulantes'!G:M,7,FALSE)","v":"CM_16_RMFEC PDP         "},"211021","000000","     ","0000000000001410","0000000000001410"," ","    ","        ","000000000000","000000000100"," ","00000","4643216546131356461","20211021","000011","                         ","                                                                                                                                                                        ","000000002500","                                                                                                                                                                                                                                                                                                                                "]
["Enregistrement 10","NON","CRE NON ACTIF","Impayés imputables Monext","2021-10-21","CB","CM_16_RMFEC PDP ",14.2,25,0,"45  ","CRE 10","14","000000","Z4","17028","17028","XA","PPT","    ","03","07",3,"17028","92282","513264KHYODHNJ31320","20211020",{"$f":"VLOOKUP(G17,'Listes déroulantes'!G:I,3,FALSE)","v":"60929700180001 "},"0000000000001420","978","2","IM ","S","           af2342567900","FAC","20211021",{"$f":"VLOOKUP(G17,'Listes déroulantes'!G:O,9,FALSE)","v":"27 AVENUE DE LA CROI"},"13","FRA",{"$f":"VLOOKUP(G17,'Listes déroulantes'!G:H,2,FALSE)","v":"CM_16_RMFEC         "},428648970580,"45  ",1,"17028","92282",{"$f":"VLOOKUP(G17,'Listes déroulantes'!G:N,8,FALSE)","v":"28293060137"},"93","001","      ",{"$f":"VLOOKUP(G17,'Listes déroulantes'!G:J,4,FALSE)","v":"9256026   "},"   ","                                  ","EUR","02","0000000000001420","LMA-17028-I-2105-0012",{"$f":"VLOOKUP(G17,'Listes déroulantes'!G:M,7,FALSE)","v":"CM_16_RMFEC PDP         "},"211021","000000","     ","0000000000001420","0000000000001420"," ","    ","        ","000000000000","000000000000"," ","00000","4643216546131356461","20211021","000012","                         ","                                                                                                                                                                        ","000000002500","                                                                                                                                                                                                                                                                                                                                "]
["Enregistrement 11","NON","CRE NON ACTIF","Impayés imputables Monext","2021-10-21","MC","CM_16_RMFEC VAD",15.1,25,1,4853,"CRE 11","14","000000","X1","17028","17028","XA","PPT","    ","03","07",3,"17028","92282","513264KHYODHNJ31321","20211020",{"$f":"VLOOKUP(G18,'Listes déroulantes'!G:I,3,FALSE)","v":"60929700180001 "},"0000000000001510","978","2","IM ","I","           af2342567901","FAC","20211021",{"$f":"VLOOKUP(G18,'Listes déroulantes'!G:O,9,FALSE)","v":"27 AVENUE DE LA CROI"},"13","FRA",{"$f":"VLOOKUP(G18,'Listes déroulantes'!G:H,2,FALSE)","v":"CM_16_RMFEC         "},428648970581,4853,1,"17028","92282",{"$f":"VLOOKUP(G18,'Listes déroulantes'!G:N,8,FALSE)","v":"28293060137"},"93","001","      ",{"$f":"VLOOKUP(G18,'Listes déroulantes'!G:J,4,FALSE)","v":"9256027   "},"   ","                                  ","EUR","02","0000000000001410","LMA-17028-I-2105-0013",{"$f":"VLOOKUP(G18,'Listes déroulantes'!G:M,7,FALSE)","v":"CM_16_RMFEC VAD         "},"211021","000000","     ","0000000000001510","0000000000001510"," ","    ","        ","000000000000","000000000100"," ","00000","4643216546131356461","20211021","000013","                         ","                                                                                                                                                                        ","000000002500","                                                                                                                                                                                                                                                                                                                                "]
["Enregistrement 12","NON","CRE NON ACTIF","Impayés imputables Monext","2021-10-21","CB","CM_16_RMFEC VAD",15.2,25,0,"45  ","CRE 12","14","000000","Z4","17028","17028","XA","PPT","    ","03","07",3,"17028","92282","513264KHYODHNJ31322","20211020",{"$f":"VLOOKUP(G19,'Listes déroulantes'!G:I,3,FALSE)","v":"60929700180001 "},"0000000000001520","978","2","IM ","S","           af2342567902","FAC","20211021",{"$f":"VLOOKUP(G19,'Listes déroulantes'!G:O,9,FALSE)","v":"27 AVENUE DE LA CROI"},"13","FRA",{"$f":"VLOOKUP(G19,'Listes déroulantes'!G:H,2,FALSE)","v":"CM_16_RMFEC         "},428648970582,"45  ",1,"17028","92282",{"$f":"VLOOKUP(G19,'Listes déroulantes'!G:N,8,FALSE)","v":"28293060137"},"93","001","      ",{"$f":"VLOOKUP(G19,'Listes déroulantes'!G:J,4,FALSE)","v":"9256027   "},"   ","                                  ","EUR","02","0000000000001520","LMA-17028-I-2105-0014",{"$f":"VLOOKUP(G19,'Listes déroulantes'!G:M,7,FALSE)","v":"CM_16_RMFEC VAD         "},"211021","000000","     ","0000000000001520","0000000000001520"," ","    ","        ","000000000000","000000000000"," ","00000","4643216546131356461","20211021","000014","                         ","                                                                                                                                                                        ","000000002500","                                                                                                                                                                                                                                                                                                                                "]
["Enregistrement 13","NON","CRE NON ACTIF","Impayés imputables Monext","2021-10-21","CB","CM_16_RMFEC VAD2",16.100000000000001,25,1,"45  ","CRE 13","14","000000","Z4","17028","17028","XA","PPT","    ","03","07",3,"17028","92282","513264KHYODHNJ31323","20211020",{"$f":"VLOOKUP(G20,'Listes déroulantes'!G:I,3,FALSE)","v":"60929700180001 "},"0000000000001610","978","2","IM ","S","           af2342567903","FAC","20211021",{"$f":"VLOOKUP(G20,'Listes déroulantes'!G:O,9,FALSE)","v":"27 AVENUE DE LA CROI"},"13","FRA",{"$f":"VLOOKUP(G20,'Listes déroulantes'!G:H,2,FALSE)","v":"CM_16_RMFEC         "},428648970583,"45  ",1,"17028","92282",{"$f":"VLOOKUP(G20,'Listes déroulantes'!G:N,8,FALSE)","v":"28293060137"},"93","001","      ",{"$f":"VLOOKUP(G20,'Listes déroulantes'!G:J,4,FALSE)","v":"9256127   "},"   ","                                  ","EUR","02","0000000000001510","LMA-17028-I-2105-0015",{"$f":"VLOOKUP(G20,'Listes déroulantes'!G:M,7,FALSE)","v":"CM_16_RMFEC VAD         "},"211021","000000","     ","0000000000001610","0000000000001610"," ","    ","        ","000000000000","000000000100"," ","00000","4643216546131356461","20211021","000015","                         ","                                                                                                                                                                        ","000000002500","                                                                                                                                                                                                                                                                                                                                "]
["Enregistrement 14","NON","CRE NON ACTIF","Impayés imputables Monext","2021-10-21","CB","CM_16_RMFEC VAD2",16.2,25,0,"45  ","CRE 14","14","000000","Z4","17028","17028","XA","PPT","    ","03","07",3,"17028","92282","513264KHYODHNJ31324","20211020",{"$f":"VLOOKUP(G21,'Listes déroulantes'!G:I,3,FALSE)","v":"60929700180001 "},"0000000000001620","978","2","IM ","S","           af2342567904","FAC","20211021",{"$f":"VLOOKUP(G21,'Listes déroulantes'!G:O,9,FALSE)","v":"27 AVENUE DE LA CROI"},"13","FRA",{"$f":"VLOOKUP(G21,'Listes déroulantes'!G:H,2,FALSE)","v":"CM_16_RMFEC         "},428648970584,"45  ",1,"17028","92282",{"$f":"VLOOKUP(G21,'Listes déroulantes'!G:N,8,FALSE)","v":"28293060137"},"93","001","      ",{"$f":"VLOOKUP(G21,'Listes déroulantes'!G:J,4,FALSE)","v":"9256127   "},"   ","                                  ","EUR","02","0000000000001620","LMA-17028-I-2105-0016",{"$f":"VLOOKUP(G21,'Listes déroulantes'!G:M,7,FALSE)","v":"CM_16_RMFEC VAD         "},"211021","000000","     ","0000000000001620","0000000000001620"," ","    ","        ","000000000000","000000000000"," ","00000","4643216546131356461","20211021","000016","                         ","                                                                                                                                                                        ","000000002500","                                                                                                                                                                                                                                                                                                                                "]
["Enregistrement 15","NON","CRE NON ACTIF","Impayés imputables Monext","2021-06-22","MC","SAS MONEXT PDP",244,25,1,"29","CRE 15","14","000000","X1","17028","17028","XA","PPT","    ","03","07",3,"17028","92282","513264KHYODHNJ31325","20210621",{"$f":"VLOOKUP(G22,'Listes déroulantes'!G:I,3,FALSE)","v":"50318500100032 "},"0000000000024400","978","2","IM ","I","           af2342567905","FAC","20210622",{"$f":"VLOOKUP(G22,'Listes déroulantes'!G:O,9,FALSE)","v":"260 RUE CLAUDE NICOL"},"13","FRA",{"$f":"VLOOKUP(G22,'Listes déroulantes'!G:H,2,FALSE)","v":"SAS MONEXT          "},428648970585,"29",1,"17028","92282",{"$f":"VLOOKUP(G22,'Listes déroulantes'!G:N,8,FALSE)","v":"20289045644"},"93","001","      ",{"$f":"VLOOKUP(G22,'Listes déroulantes'!G:J,4,FALSE)","v":"9255001   "},"   ","                                  ","EUR","02","0000000000024300","LMA-17028-I-2105-0017",{"$f":"VLOOKUP(G22,'Listes déroulantes'!G:M,7,FALSE)","v":"MONEXT                  "},"220621","000000","     ","0000000000024400","0000000000024400"," ","    ","        ","000000000000","000000000100"," ","00000","4643216546131356461","20210622","000017","                         ","                                                                                                                                                                        ","000000002500","                                                                                                                                                                                                                                                                                                                                "]
["Enregistrement 16","NON","CRE NON ACTIF","Impayés imputables Monext","2021-06-22","MC","SAS MONEXT PDP",245,25,1,"30","CRE 16","14","000000","X1","17028","17028","XA","PPT","    ","03","07",3,"17028","92282","513264KHYODHNJ31326","20210621",{"$f":"VLOOKUP(G23,'Listes déroulantes'!G:I,3,FALSE)","v":"50318500100032 "},"0000000000024500","978","2","IM ","I","           af2342567906","FAC","20210622",{"$f":"VLOOKUP(G23,'Listes déroulantes'!G:O,9,FALSE)","v":"260 RUE CLAUDE NICOL"},"13","FRA",{"$f":"VLOOKUP(G23,'Listes déroulantes'!G:H,2,FALSE)","v":"SAS MONEXT          "},428648970586,"30",1,"17028","92282",{"$f":"VLOOKUP(G23,'Listes déroulantes'!G:N,8,FALSE)","v":"20289045644"},"93","001","      ",{"$f":"VLOOKUP(G23,'Listes déroulantes'!G:J,4,FALSE)","v":"9255001   "},"   ","                                  ","EUR","02","0000000000024400","LMA-17028-I-2105-0018",{"$f":"VLOOKUP(G23,'Listes déroulantes'!G:M,7,FALSE)","v":"MONEXT                  "},"220621","000000","     ","0000000000024500","0000000000024500"," ","    ","        ","000000000000","000000000100"," ","00000","4643216546131356461","20210622","000018","                         ","                                                                                                                                                                        ","000000002500","                                                                                                                                                                                                                                                                                                                                "]
["Enregistrement 17","NON","CRE NON ACTIF","Impayés imputables Monext","2021-06-22","MC","SAS MONEXT PDP",246,25,1,"31","CRE 17","14","000000","X1","17028","17028","XA","PPT","    ","03","07",3,"17028","92282","513264KHYODHNJ31327","20210621",{"$f":"VLOOKUP(G24,'Listes déroulantes'!G:I,3,FALSE)","v":"50318500100032 "},"0000000000024600","978","2","IM ","I","           af2342567907","FAC","20210622",{"$f":"VLOOKUP(G24,'Listes déroulantes'!G:O,9,FALSE)","v":"260 RUE CLAUDE NICOL"},"13","FRA",{"$f":"VLOOKUP(G24,'Listes déroulantes'!G:H,2,FALSE)","v":"SAS MONEXT          "},428648970587,"31",1,"17028","92282",{"$f":"VLOOKUP(G24,'Listes déroulantes'!G:N,8,FALSE)","v":"20289045644"},"93","001","      ",{"$f":"VLOOKUP(G24,'Listes déroulantes'!G:J,4,FALSE)","v":"9255001   "},"   ","                                  ","EUR","02","0000000000024500","LMA-17028-I-2105-0019",{"$f":"VLOOKUP(G24,'Listes déroulantes'!G:M,7,FALSE)","v":"MONEXT                  "},"220621","000000","     ","0000000000024600","0000000000024600"," ","    ","        ","000000000000","000000000100"," ","00000","4643216546131356461","20210622","000019","                         ","                                                                                                                                                                        ","000000002500","                                                                                                                                                                                                                                                                                                                                "]
["Enregistrement 18","NON","CRE NON ACTIF","Impayés imputables Monext","2021-06-22","MC","SAS MONEXT PDP",247,25,1,"32","CRE 18","14","000000","X1","17028","17028","XA","PPT","    ","03","07",3,"17028","92282","513264KHYODHNJ31328","20210621",{"$f":"VLOOKUP(G25,'Listes déroulantes'!G:I,3,FALSE)","v":"50318500100032 "},"0000000000024700","978","2","IM ","I","           af2342567908","FAC","20210622",{"$f":"VLOOKUP(G25,'Listes déroulantes'!G:O,9,FALSE)","v":"260 RUE CLAUDE NICOL"},"13","FRA",{"$f":"VLOOKUP(G25,'Listes déroulantes'!G:H,2,FALSE)","v":"SAS MONEXT          "},428648970588,"32",1,"17028","92282",{"$f":"VLOOKUP(G25,'Listes déroulantes'!G:N,8,FALSE)","v":"20289045644"},"93","001","      ",{"$f":"VLOOKUP(G25,'Listes déroulantes'!G:J,4,FALSE)","v":"9255001   "},"   ","                                  ","EUR","02","0000000000024600","LMA-17028-I-2105-0020",{"$f":"VLOOKUP(G25,'Listes déroulantes'!G:M,7,FALSE)","v":"MONEXT                  "},"220621","000000","     ","0000000000024700","0000000000024700"," ","    ","        ","000000000000","000000000100"," ","00000","4643216546131356461","20210622","000020","                         ","                                                                                                                                                                        ","000000002500","                                                                                                                                                                                                                                                                                                                                "]
["Enregistrement 19","NON","CRE NON ACTIF","Impayés imputables Monext","2021-06-22","MC","SAS MONEXT PDP",248,25,1,"33","CRE 19","14","000000","X1","17028","17028","XA","PPT","    ","03","07",3,"17028","92282","513264KHYODHNJ31329","20210621",{"$f":"VLOOKUP(G26,'Listes déroulantes'!G:I,3,FALSE)","v":"50318500100032 "},"0000000000024800","978","2","IM ","I","           af2342567909","FAC","20210622",{"$f":"VLOOKUP(G26,'Listes déroulantes'!G:O,9,FALSE)","v":"260 RUE CLAUDE NICOL"},"13","FRA",{"$f":"VLOOKUP(G26,'Listes déroulantes'!G:H,2,FALSE)","v":"SAS MONEXT          "},428648970589,"33",1,"17028","92282",{"$f":"VLOOKUP(G26,'Listes déroulantes'!G:N,8,FALSE)","v":"20289045644"},"93","001","      ",{"$f":"VLOOKUP(G26,'Listes déroulantes'!G:J,4,FALSE)","v":"9255001   "},"   ","                                  ","EUR","02","0000000000024700","LMA-17028-I-2105-0021",{"$f":"VLOOKUP(G26,'Listes déroulantes'!G:M,7,FALSE)","v":"MONEXT                  "},"220621","000000","     ","0000000000024800","0000000000024800"," ","    ","        ","000000000000","000000000100"," ","00000","4643216546131356461","20210622","000021","                         ","                                                                                                                                                                        ","000000002500","                                                                                                                                                                                                                                                                                                                                "]
["Enregistrement 20","NON","CRE NON ACTIF","Impayés imputables Monext","2021-06-22","MC","SAS MONEXT PDP",249,25,1,"34","CRE 20","14","000000","X1","17028","17028","XA","PPT","    ","03","07",3,"17028","92282","513264KHYODHNJ31330","20210621",{"$f":"VLOOKUP(G27,'Listes déroulantes'!G:I,3,FALSE)","v":"50318500100032 "},"0000000000024900","978","2","IM ","I","           af2342567910","FAC","20210622",{"$f":"VLOOKUP(G27,'Listes déroulantes'!G:O,9,FALSE)","v":"260 RUE CLAUDE NICOL"},"13","FRA",{"$f":"VLOOKUP(G27,'Listes déroulantes'!G:H,2,FALSE)","v":"SAS MONEXT          "},428648970590,"34",1,"17028","92282",{"$f":"VLOOKUP(G27,'Listes déroulantes'!G:N,8,FALSE)","v":"20289045644"},"93","001","      ",{"$f":"VLOOKUP(G27,'Listes déroulantes'!G:J,4,FALSE)","v":"9255001   "},"   ","                                  ","EUR","02","0000000000024800","LMA-17028-I-2105-0022",{"$f":"VLOOKUP(G27,'Listes déroulantes'!G:M,7,FALSE)","v":"MONEXT                  "},"220621","000000","     ","0000000000024900","0000000000024900"," ","    ","        ","000000000000","000000000100"," ","00000","4643216546131356461","20210622","000022","                         ","                                                                                                                                                                        ","000000002500","                                                                                                                                                                                                                                                                                                                                "]
["Enregistrement 21","NON","CRE NON ACTIF","Impayés imputables Monext","2021-06-22","MC","SAS MONEXT PDP",250,25,1,"35","CRE 21","14","000000","X1","17028","17028","XA","PPT","    ","03","07",3,"17028","92282","513264KHYODHNJ31331","20210621",{"$f":"VLOOKUP(G28,'Listes déroulantes'!G:I,3,FALSE)","v":"50318500100032 "},"0000000000025000","978","2","IM ","I","           af2342567911","FAC","20210622",{"$f":"VLOOKUP(G28,'Listes déroulantes'!G:O,9,FALSE)","v":"260 RUE CLAUDE NICOL"},"13","FRA",{"$f":"VLOOKUP(G28,'Listes déroulantes'!G:H,2,FALSE)","v":"SAS MONEXT          "},428648970591,"35",1,"17028","92282",{"$f":"VLOOKUP(G28,'Listes déroulantes'!G:N,8,FALSE)","v":"20289045644"},"93","001","      ",{"$f":"VLOOKUP(G28,'Listes déroulantes'!G:J,4,FALSE)","v":"9255001   "},"   ","                                  ","EUR","02","0000000000024900","LMA-17028-I-2105-0023",{"$f":"VLOOKUP(G28,'Listes déroulantes'!G:M,7,FALSE)","v":"MONEXT                  "},"220621","000000","     ","0000000000025000","0000000000025000"," ","    ","        ","000000000000","000000000100"," ","00000","4643216546131356461","20210622","000023","                         ","                                                                                                                                                                        ","000000002500","                                                                                                                                                                                                                                                                                                                                "]
["Enregistrement 22","NON","CRE NON ACTIF","Impayés imputables Monext","2021-06-22","MC","SAS MONEXT PDP",251,25,1,"36","CRE 22","14","000000","X1","17028","17028","XA","PPT","    ","03","07",3,"17028","92282","513264KHYODHNJ31332","20210621",{"$f":"VLOOKUP(G29,'Listes déroulantes'!G:I,3,FALSE)","v":"50318500100032 "},"0000000000025100","978","2","IM ","I","           af2342567912","FAC","20210622",{"$f":"VLOOKUP(G29,'Listes déroulantes'!G:O,9,FALSE)","v":"260 RUE CLAUDE NICOL"},"13","FRA",{"$f":"VLOOKUP(G29,'Listes déroulantes'!G:H,2,FALSE)","v":"SAS MONEXT          "},428648970592,"36",1,"17028","92282",{"$f":"VLOOKUP(G29,'Listes déroulantes'!G:N,8,FALSE)","v":"20289045644"},"93","001","      ",{"$f":"VLOOKUP(G29,'Listes déroulantes'!G:J,4,FALSE)","v":"9255001   "},"   ","                                  ","EUR","02","0000000000025000","LMA-17028-I-2105-0024",{"$f":"VLOOKUP(G29,'Listes déroulantes'!G:M,7,FALSE)","v":"MONEXT                  "},"220621","000000","     ","0000000000025100","0000000000025100"," ","    ","        ","000000000000","000000000100"," ","00000","4643216546131356461","20210622","000024","                         ","                                                                                                                                                                        ","000000002500","                                                                                                                                                                                                                                                                                                                                "]
["Enregistrement 23","NON","CRE NON ACTIF","Impayés imputables Monext","2021-06-22","MC","SAS MONEXT PDP",252,25,1,"37","CRE 23","14","000000","X1","17028","17028","XA","PPT","    ","03","07",3,"17028","92282","513264KHYODHNJ31333","20210621",{"$f":"VLOOKUP(G30,'Listes déroulantes'!G:I,3,FALSE)","v":"50318500100032 "},"0000000000025200","978","2","IM ","I","           af2342567913","FAC","20210622",{"$f":"VLOOKUP(G30,'Listes déroulantes'!G:O,9,FALSE)","v":"260 RUE CLAUDE NICOL"},"13","FRA",{"$f":"VLOOKUP(G30,'Listes déroulantes'!G:H,2,FALSE)","v":"SAS MONEXT          "},428648970593,"37",1,"17028","92282",{"$f":"VLOOKUP(G30,'Listes déroulantes'!G:N,8,FALSE)","v":"20289045644"},"93","001","      ",{"$f":"VLOOKUP(G30,'Listes déroulantes'!G:J,4,FALSE)","v":"9255001   "},"   ","                                  ","EUR","02","0000000000025100","LMA-17028-I-2105-0025",{"$f":"VLOOKUP(G30,'Listes déroulantes'!G:M,7,FALSE)","v":"MONEXT                  "},"220621","000000","     ","0000000000025200","0000000000025200"," ","    ","        ","000000000000","000000000100"," ","00000","4643216546131356461","20210622","000025","                         ","                                                                                                                                                                        ","000000002500","                                                                                                                                                                                                                                                                                                                                "]
["Enregistrement 24","NON","CRE NON ACTIF","Impayés imputables Monext","2021-06-22","MC","SAS MONEXT PDP",253,25,1,"38","CRE 24","14","000000","X1","17028","17028","XA","PPT","    ","03","07",3,"17028","92282","513264KHYODHNJ31334","20210621",{"$f":"VLOOKUP(G31,'Listes déroulantes'!G:I,3,FALSE)","v":"50318500100032 "},"0000000000025300","978","2","IM ","I","           af2342567914","FAC","20210622",{"$f":"VLOOKUP(G31,'Listes déroulantes'!G:O,9,FALSE)","v":"260 RUE CLAUDE NICOL"},"13","FRA",{"$f":"VLOOKUP(G31,'Listes déroulantes'!G:H,2,FALSE)","v":"SAS MONEXT          "},428648970594,"38",1,"17028","92282",{"$f":"VLOOKUP(G31,'Listes déroulantes'!G:N,8,FALSE)","v":"20289045644"},"93","001","      ",{"$f":"VLOOKUP(G31,'Listes déroulantes'!G:J,4,FALSE)","v":"9255001   "},"   ","                                  ","EUR","02","0000000000025200","LMA-17028-I-2105-0026",{"$f":"VLOOKUP(G31,'Listes déroulantes'!G:M,7,FALSE)","v":"MONEXT                  "},"220621","000000","     ","0000000000025300","0000000000025300"," ","    ","        ","000000000000","000000000100"," ","00000","4643216546131356461","20210622","000026","                         ","                                                                                                                                                                        ","000000002500","                                                                                                                                                                                                                                                                                                                                "]
["Enregistrement 25","NON","CRE NON ACTIF","Impayés imputables Monext","2021-06-22","MC","SAS MONEXT PDP",254,25,1,"39","CRE 25","14","000000","X1","17028","17028","XA","PPT","    ","03","07",3,"17028","92282","513264KHYODHNJ31335","20210621",{"$f":"VLOOKUP(G32,'Listes déroulantes'!G:I,3,FALSE)","v":"50318500100032 "},"0000000000025400","978","2","IM ","I","           af2342567915","FAC","20210622",{"$f":"VLOOKUP(G32,'Listes déroulantes'!G:O,9,FALSE)","v":"260 RUE CLAUDE NICOL"},"13","FRA",{"$f":"VLOOKUP(G32,'Listes déroulantes'!G:H,2,FALSE)","v":"SAS MONEXT          "},428648970595,"39",1,"17028","92282",{"$f":"VLOOKUP(G32,'Listes déroulantes'!G:N,8,FALSE)","v":"20289045644"},"93","001","      ",{"$f":"VLOOKUP(G32,'Listes déroulantes'!G:J,4,FALSE)","v":"9255001   "},"   ","                                  ","EUR","02","0000000000025300","LMA-17028-I-2105-0027",{"$f":"VLOOKUP(G32,'Listes déroulantes'!G:M,7,FALSE)","v":"MONEXT                  "},"220621","000000","     ","0000000000025400","0000000000025400"," ","    ","        ","000000000000","000000000100"," ","00000","4643216546131356461","20210622","000027","                         ","                                                                                                                                                                        ","000000002500","                                                                                                                                                                                                                                                                                                                                "]
["Enregistrement 26","NON","CRE NON ACTIF","Impayés imputables Monext","2021-06-22","MC","SAS MONEXT PDP",255,25,1,"40","CRE 26","14","000000","X1","17028","17028","XA","PPT","    ","03","07",3,"17028","92282","513264KHYODHNJ31336","20210621",{"$f":"VLOOKUP(G33,'Listes déroulantes'!G:I,3,FALSE)","v":"50318500100032 "},"0000000000025500","978","2","IM ","I","           af2342567916","FAC","20210622",{"$f":"VLOOKUP(G33,'Listes déroulantes'!G:O,9,FALSE)","v":"260 RUE CLAUDE NICOL"},"13","FRA",{"$f":"VLOOKUP(G33,'Listes déroulantes'!G:H,2,FALSE)","v":"SAS MONEXT          "},428648970596,"40",1,"17028","92282",{"$f":"VLOOKUP(G33,'Listes déroulantes'!G:N,8,FALSE)","v":"20289045644"},"93","001","      ",{"$f":"VLOOKUP(G33,'Listes déroulantes'!G:J,4,FALSE)","v":"9255001   "},"   ","                                  ","EUR","02","0000000000025400","LMA-17028-I-2105-0028",{"$f":"VLOOKUP(G33,'Listes déroulantes'!G:M,7,FALSE)","v":"MONEXT                  "},"220621","000000","     ","0000000000025500","0000000000025500"," ","    ","        ","000000000000","000000000100"," ","00000","4643216546131356461","20210622","000028","                         ","                                                                                                                                                                        ","000000002500","                                                                                                                                                                                                                                                                                                                                "]
["Enregistrement 27","NON","CRE NON ACTIF","Impayés imputables Monext","2021-06-22","MC","SAS MONEXT PDP",256,25,1,"41","CRE 27","14","000000","X1","17028","17028","XA","PPT","    ","03","07",3,"17028","92282","513264KHYODHNJ31337","20210621",{"$f":"VLOOKUP(G34,'Listes déroulantes'!G:I,3,FALSE)","v":"50318500100032 "},"0000000000025600","978","2","IM ","I","           af2342567917","FAC","20210622",{"$f":"VLOOKUP(G34,'Listes déroulantes'!G:O,9,FALSE)","v":"260 RUE CLAUDE NICOL"},"13","FRA",{"$f":"VLOOKUP(G34,'Listes déroulantes'!G:H,2,FALSE)","v":"SAS MONEXT          "},428648970597,"41",1,"17028","92282",{"$f":"VLOOKUP(G34,'Listes déroulantes'!G:N,8,FALSE)","v":"20289045644"},"93","001","      ",{"$f":"VLOOKUP(G34,'Listes déroulantes'!G:J,4,FALSE)","v":"9255001   "},"   ","                                  ","EUR","02","0000000000025500","LMA-17028-I-2105-0029",{"$f":"VLOOKUP(G34,'Listes déroulantes'!G:M,7,FALSE)","v":"MONEXT                  "},"220621","000000","     ","0000000000025600","0000000000025600"," ","    ","        ","000000000000","000000000100"," ","00000","4643216546131356461","20210622","000029","                         ","                                                                                                                                                                        ","000000002500","                                                                                                                                                                                                                                                                                                                                "]
["Enregistrement 28","NON","CRE NON ACTIF","Impayés imputables Monext","2021-06-22","MC","SAS MONEXT PDP",257,25,1,"42","CRE 28","14","000000","X1","17028","17028","XA","PPT","    ","03","07",3,"17028","92282","513264KHYODHNJ31338","20210621",{"$f":"VLOOKUP(G35,'Listes déroulantes'!G:I,3,FALSE)","v":"50318500100032 "},"0000000000025700","978","2","IM ","I","           af2342567918","FAC","20210622",{"$f":"VLOOKUP(G35,'Listes déroulantes'!G:O,9,FALSE)","v":"260 RUE CLAUDE NICOL"},"13","FRA",{"$f":"VLOOKUP(G35,'Listes déroulantes'!G:H,2,FALSE)","v":"SAS MONEXT          "},428648970598,"42",1,"17028","92282",{"$f":"VLOOKUP(G35,'Listes déroulantes'!G:N,8,FALSE)","v":"20289045644"},"93","001","      ",{"$f":"VLOOKUP(G35,'Listes déroulantes'!G:J,4,FALSE)","v":"9255001   "},"   ","                                  ","EUR","02","0000000000025600","LMA-17028-I-2105-0030",{"$f":"VLOOKUP(G35,'Listes déroulantes'!G:M,7,FALSE)","v":"MONEXT                  "},"220621","000000","     ","0000000000025700","0000000000025700"," ","    ","        ","000000000000","000000000100"," ","00000","4643216546131356461","20210622","000030","                         ","                                                                                                                                                                        ","000000002500","                                                                                                                                                                                                                                                                                                                                "]
["Enregistrement 29","NON","CRE NON ACTIF","Impayés imputables Monext","2021-06-22","MC","SAS MONEXT PDP",258,25,1,"43","CRE 29","14","000000","X1","17028","17028","XA","PPT","    ","03","07",3,"17028","92282","513264KHYODHNJ31339","20210621",{"$f":"VLOOKUP(G36,'Listes déroulantes'!G:I,3,FALSE)","v":"50318500100032 "},"0000000000025800","978","2","IM ","I","           af2342567919","FAC","20210622",{"$f":"VLOOKUP(G36,'Listes déroulantes'!G:O,9,FALSE)","v":"260 RUE CLAUDE NICOL"},"13","FRA",{"$f":"VLOOKUP(G36,'Listes déroulantes'!G:H,2,FALSE)","v":"SAS MONEXT          "},428648970599,"43",1,"17028","92282",{"$f":"VLOOKUP(G36,'Listes déroulantes'!G:N,8,FALSE)","v":"20289045644"},"93","001","      ",{"$f":"VLOOKUP(G36,'Listes déroulantes'!G:J,4,FALSE)","v":"9255001   "},"   ","                                  ","EUR","02","0000000000025700","LMA-17028-I-2105-0031",{"$f":"VLOOKUP(G36,'Listes déroulantes'!G:M,7,FALSE)","v":"MONEXT                  "},"220621","000000","     ","0000000000025800","0000000000025800"," ","    ","        ","000000000000","000000000100"," ","00000","4643216546131356461","20210622","000031","                         ","                                                                                                                                                                        ","000000002500","                                                                                                                                                                                                                                                                                                                                "]
["Enregistrement 30","NON","CRE NON ACTIF","Impayés imputables Monext","2021-06-22","MC","SAS MONEXT PDP",259,25,1,"44","CRE 30","14","000000","X1","17028","17028","XA","PPT","    ","03","07",3,"17028","92282","513264KHYODHNJ31340","20210621",{"$f":"VLOOKUP(G37,'Listes déroulantes'!G:I,3,FALSE)","v":"50318500100032 "},"0000000000025900","978","2","IM ","I","           af2342567920","FAC","20210622",{"$f":"VLOOKUP(G37,'Listes déroulantes'!G:O,9,FALSE)","v":"260 RUE CLAUDE NICOL"},"13","FRA",{"$f":"VLOOKUP(G37,'Listes déroulantes'!G:H,2,FALSE)","v":"SAS MONEXT          "},428648970600,"44",1,"17028","92282",{"$f":"VLOOKUP(G37,'Listes déroulantes'!G:N,8,FALSE)","v":"20289045644"},"93","001","      ",{"$f":"VLOOKUP(G37,'Listes déroulantes'!G:J,4,FALSE)","v":"9255001   "},"   ","                                  ","EUR","02","0000000000025800","LMA-17028-I-2105-0032",{"$f":"VLOOKUP(G37,'Listes déroulantes'!G:M,7,FALSE)","v":"MONEXT                  "},"220621","000000","     ","0000000000025900","0000000000025900"," ","    ","        ","000000000000","000000000100"," ","00000","4643216546131356461","20210622","000032","                         ","                                                                                                                                                                        ","000000002500","                                                                                                                                                                                                                                                                                                                                "]
["Enregistrement 31","NON","CRE NON ACTIF","Impayés imputables Monext","2021-06-22","MC","SAS MONEXT PDP",260,25,1,"45","CRE 31","14","000000","X1","17028","17028","XA","PPT","    ","03","07",3,"17028","92282","513264KHYODHNJ31341","20210621",{"$f":"VLOOKUP(G38,'Listes déroulantes'!G:I,3,FALSE)","v":"50318500100032 "},"0000000000026000","978","2","IM ","I","           af2342567921","FAC","20210622",{"$f":"VLOOKUP(G38,'Listes déroulantes'!G:O,9,FALSE)","v":"260 RUE CLAUDE NICOL"},"13","FRA",{"$f":"VLOOKUP(G38,'Listes déroulantes'!G:H,2,FALSE)","v":"SAS MONEXT          "},428648970601,"45",1,"17028","92282",{"$f":"VLOOKUP(G38,'Listes déroulantes'!G:N,8,FALSE)","v":"20289045644"},"93","001","      ",{"$f":"VLOOKUP(G38,'Listes déroulantes'!G:J,4,FALSE)","v":"9255001   "},"   ","                                  ","EUR","02","0000000000025900","LMA-17028-I-2105-0033",{"$f":"VLOOKUP(G38,'Listes déroulantes'!G:M,7,FALSE)","v":"MONEXT                  "},"220621","000000","     ","0000000000026000","0000000000026000"," ","    ","        ","000000000000","000000000100"," ","00000","4643216546131356461","20210622","000033","                         ","                                                                                                                                                                        ","000000002500","                                                                                                                                                                                                                                                                                                                                "]
["Enregistrement 32","NON","CRE NON ACTIF","Impayés imputables Monext","2021-06-22","MC","SAS MONEXT PDP",261,25,1,"46","CRE 32","14","000000","X1","17028","17028","XA","PPT","    ","03","07",3,"17028","92282","513264KHYODHNJ31342","20210621",{"$f":"VLOOKUP(G39,'Listes déroulantes'!G:I,3,FALSE)","v":"50318500100032 "},"0000000000026100","978","2","IM ","I","           af2342567922","FAC","20210622",{"$f":"VLOOKUP(G39,'Listes déroulantes'!G:O,9,FALSE)","v":"260 RUE CLAUDE NICOL"},"13","FRA",{"$f":"VLOOKUP(G39,'Listes déroulantes'!G:H,2,FALSE)","v":"SAS MONEXT          "},428648970602,"46",1,"17028","92282",{"$f":"VLOOKUP(G39,'Listes déroulantes'!G:N,8,FALSE)","v":"20289045644"},"93","001","      ",{"$f":"VLOOKUP(G39,'Listes déroulantes'!G:J,4,FALSE)","v":"9255001   "},"   ","                                  ","EUR","02","0000000000026000","LMA-17028-I-2105-0034",{"$f":"VLOOKUP(G39,'Listes déroulantes'!G:M,7,FALSE)","v":"MONEXT                  "},"220621","000000","     ","0000000000026100","0000000000026100"," ","    ","        ","000000000000","000000000100"," ","00000","4643216546131356461","20210622","000034","                         ","                                                                                                                                                                        ","000000002500","                                                                                                                                                                                                                                                                                                                                "]
["Enregistrement 33","NON","CRE NON ACTIF","Impayés imputables Monext","2021-06-22","MC","SAS MONEXT PDP",262,25,1,"47","CRE 33","14","000000","X1","17028","17028","XA","PPT","    ","03","07",3,"17028","92282","513264KHYODHNJ31343","20210621",{"$f":"VLOOKUP(G40,'Listes déroulantes'!G:I,3,FALSE)","v":"50318500100032 "},"0000000000026200","978","2","IM ","I","           af2342567923","FAC","20210622",{"$f":"VLOOKUP(G40,'Listes déroulantes'!G:O,9,FALSE)","v":"260 RUE CLAUDE NICOL"},"13","FRA",{"$f":"VLOOKUP(G40,'Listes déroulantes'!G:H,2,FALSE)","v":"SAS MONEXT          "},428648970603,"47",1,"17028","92282",{"$f":"VLOOKUP(G40,'Listes déroulantes'!G:N,8,FALSE)","v":"20289045644"},"93","001","      ",{"$f":"VLOOKUP(G40,'Listes déroulantes'!G:J,4,FALSE)","v":"9255001   "},"   ","                                  ","EUR","02","0000000000026100","LMA-17028-I-2105-0035",{"$f":"VLOOKUP(G40,'Listes déroulantes'!G:M,7,FALSE)","v":"MONEXT                  "},"220621","000000","     ","0000000000026200","0000000000026200"," ","    ","        ","000000000000","000000000100"," ","00000","4643216546131356461","20210622","000035","                         ","                                                                                                                                                                        ","000000002500","                                                                                                                                                                                                                                                                                                                                "]
["Enregistrement 34","NON","CRE NON ACTIF","Impayés imputables Monext","2021-06-22","MC","SAS MONEXT PDP",263,25,1,"48","CRE 34","14","000000","X1","17028","17028","XA","PPT","    ","03","07",3,"17028","92282","513264KHYODHNJ31344","20210621",{"$f":"VLOOKUP(G41,'Listes déroulantes'!G:I,3,FALSE)","v":"50318500100032 "},"0000000000026300","978","2","IM ","I","           af2342567924","FAC","20210622",{"$f":"VLOOKUP(G41,'Listes déroulantes'!G:O,9,FALSE)","v":"260 RUE CLAUDE NICOL"},"13","FRA",{"$f":"VLOOKUP(G41,'Listes déroulantes'!G:H,2,FALSE)","v":"SAS MONEXT          "},428648970604,"48",1,"17028","92282",{"$f":"VLOOKUP(G41,'Listes déroulantes'!G:N,8,FALSE)","v":"20289045644"},"93","001","      ",{"$f":"VLOOKUP(G41,'Listes déroulantes'!G:J,4,FALSE)","v":"9255001   "},"   ","                                  ","EUR","02","0000000000026200","LMA-17028-I-2105-0036",{"$f":"VLOOKUP(G41,'Listes déroulantes'!G:M,7,FALSE)","v":"MONEXT                  "},"220621","000000","     ","0000000000026300","0000000000026300"," ","    ","        ","000000000000","000000000100"," ","00000","4643216546131356461","20210622","000036","                         ","                                                                                                                                                                        ","000000002500","                                                                                                                                                                                                                                                                                                                                "]
["Enregistrement 35","NON","CRE NON ACTIF","Impayés imputables Monext","2021-06-22","MC","SAS MONEXT PDP",264,25,1,"49","CRE 35","14","000000","X1","17028","17028","XA","PPT","    ","03","07",3,"17028","92282","513264KHYODHNJ31345","20210621",{"$f":"VLOOKUP(G42,'Listes déroulantes'!G:I,3,FALSE)","v":"50318500100032 "},"0000000000026400","978","2","IM ","I","           af2342567925","FAC","20210622",{"$f":"VLOOKUP(G42,'Listes déroulantes'!G:O,9,FALSE)","v":"260 RUE CLAUDE NICOL"},"13","FRA",{"$f":"VLOOKUP(G42,'Listes déroulantes'!G:H,2,FALSE)","v":"SAS MONEXT          "},428648970605,"49",1,"17028","92282",{"$f":"VLOOKUP(G42,'Listes déroulantes'!G:N,8,FALSE)","v":"20289045644"},"93","001","      ",{"$f":"VLOOKUP(G42,'Listes déroulantes'!G:J,4,FALSE)","v":"9255001   "},"   ","                                  ","EUR","02","0000000000026300","LMA-17028-I-2105-0037",{"$f":"VLOOKUP(G42,'Listes déroulantes'!G:M,7,FALSE)","v":"MONEXT                  "},"220621","000000","     ","0000000000026400","0000000000026400"," ","    ","        ","000000000000","000000000100"," ","00000","4643216546131356461","20210622","000037","                         ","                                                                                                                                                                        ","000000002500","                                                                                                                                                                                                                                                                                                                                "]
["Enregistrement 36","NON","CRE NON ACTIF","Impayés imputables Monext","2021-06-22","MC","SAS MONEXT PDP",265,25,1,"50","CRE 36","14","000000","X1","17028","17028","XA","PPT","    ","03","07",3,"17028","92282","513264KHYODHNJ31346","20210621",{"$f":"VLOOKUP(G43,'Listes déroulantes'!G:I,3,FALSE)","v":"50318500100032 "},"0000000000026500","978","2","IM ","I","           af2342567926","FAC","20210622",{"$f":"VLOOKUP(G43,'Listes déroulantes'!G:O,9,FALSE)","v":"260 RUE CLAUDE NICOL"},"13","FRA",{"$f":"VLOOKUP(G43,'Listes déroulantes'!G:H,2,FALSE)","v":"SAS MONEXT          "},428648970606,"50",1,"17028","92282",{"$f":"VLOOKUP(G43,'Listes déroulantes'!G:N,8,FALSE)","v":"20289045644"},"93","001","      ",{"$f":"VLOOKUP(G43,'Listes déroulantes'!G:J,4,FALSE)","v":"9255001   "},"   ","                                  ","EUR","02","0000000000026400","LMA-17028-I-2105-0038",{"$f":"VLOOKUP(G43,'Listes déroulantes'!G:M,7,FALSE)","v":"MONEXT                  "},"220621","000000","     ","0000000000026500","0000000000026500"," ","    ","        ","000000000000","000000000100"," ","00000","4643216546131356461","20210622","000038","                         ","                                                                                                                                                                        ","000000002500","                                                                                                                                                                                                                                                                                                                                "]
["Enregistrement 37","NON","CRE NON ACTIF","Impayés imputables Monext","2021-06-22","MC","SAS MONEXT PDP",266,25,1,"51","CRE 37","14","000000","X1","17028","17028","XA","PPT","    ","03","07",3,"17028","92282","513264KHYODHNJ31347","20210621",{"$f":"VLOOKUP(G44,'Listes déroulantes'!G:I,3,FALSE)","v":"50318500100032 "},"0000000000026600","978","2","IM ","I","           af2342567927","FAC","20210622",{"$f":"VLOOKUP(G44,'Listes déroulantes'!G:O,9,FALSE)","v":"260 RUE CLAUDE NICOL"},"13","FRA",{"$f":"VLOOKUP(G44,'Listes déroulantes'!G:H,2,FALSE)","v":"SAS MONEXT          "},428648970607,"51",1,"17028","92282",{"$f":"VLOOKUP(G44,'Listes déroulantes'!G:N,8,FALSE)","v":"20289045644"},"93","001","      ",{"$f":"VLOOKUP(G44,'Listes déroulantes'!G:J,4,FALSE)","v":"9255001   "},"   ","                                  ","EUR","02","0000000000026500","LMA-17028-I-2105-0039",{"$f":"VLOOKUP(G44,'Listes déroulantes'!G:M,7,FALSE)","v":"MONEXT                  "},"220621","000000","     ","0000000000026600","0000000000026600"," ","    ","        ","000000000000","000000000100"," ","00000","4643216546131356461","20210622","000039","                         ","                                                                                                                                                                        ","000000002500","                                                                                                                                                                                                                                                                                                                                "]
["Enregistrement 38","NON","CRE NON ACTIF","Impayés imputables Monext","2021-06-22","MC","SAS MONEXT PDP",267,25,1,"52","CRE 38","14","000000","X1","17028","17028","XA","PPT","    ","03","07",3,"17028","92282","513264KHYODHNJ31348","20210621",{"$f":"VLOOKUP(G45,'Listes déroulantes'!G:I,3,FALSE)","v":"50318500100032 "},"0000000000026700","978","2","IM ","I","           af2342567928","FAC","20210622",{"$f":"VLOOKUP(G45,'Listes déroulantes'!G:O,9,FALSE)","v":"260 RUE CLAUDE NICOL"},"13","FRA",{"$f":"VLOOKUP(G45,'Listes déroulantes'!G:H,2,FALSE)","v":"SAS MONEXT          "},428648970608,"52",1,"17028","92282",{"$f":"VLOOKUP(G45,'Listes déroulantes'!G:N,8,FALSE)","v":"20289045644"},"93","001","      ",{"$f":"VLOOKUP(G45,'Listes déroulantes'!G:J,4,FALSE)","v":"9255001   "},"   ","                                  ","EUR","02","0000000000026600","LMA-17028-I-2105-0040",{"$f":"VLOOKUP(G45,'Listes déroulantes'!G:M,7,FALSE)","v":"MONEXT                  "},"220621","000000","     ","0000000000026700","0000000000026700"," ","    ","        ","000000000000","000000000100"," ","00000","4643216546131356461","20210622","000040","                         ","                                                                                                                                                                        ","000000002500","                                                                                                                                                                                                                                                                                                                                "]
["Enregistrement 39","NON","CRE NON ACTIF","Impayés imputables Monext","2021-06-22","MC","SAS MONEXT PDP",268,25,1,"53","CRE 39","14","000000","X1","17028","17028","XA","PPT","    ","03","07",3,"17028","92282","513264KHYODHNJ31349","20210621",{"$f":"VLOOKUP(G46,'Listes déroulantes'!G:I,3,FALSE)","v":"50318500100032 "},"0000000000026800","978","2","IM ","I","           af2342567929","FAC","20210622",{"$f":"VLOOKUP(G46,'Listes déroulantes'!G:O,9,FALSE)","v":"260 RUE CLAUDE NICOL"},"13","FRA",{"$f":"VLOOKUP(G46,'Listes déroulantes'!G:H,2,FALSE)","v":"SAS MONEXT          "},428648970609,"53",1,"17028","92282",{"$f":"VLOOKUP(G46,'Listes déroulantes'!G:N,8,FALSE)","v":"20289045644"},"93","001","      ",{"$f":"VLOOKUP(G46,'Listes déroulantes'!G:J,4,FALSE)","v":"9255001   "},"   ","                                  ","EUR","02","0000000000026700","LMA-17028-I-2105-0041",{"$f":"VLOOKUP(G46,'Listes déroulantes'!G:M,7,FALSE)","v":"MONEXT                  "},"220621","000000","     ","0000000000026800","0000000000026800"," ","    ","        ","000000000000","000000000100"," ","00000","4643216546131356461","20210622","000041","                         ","                                                                                                                                                                        ","000000002500","                                                                                                                                                                                                                                                                                                                                "]
["Enregistrement 40","NON","CRE NON ACTIF","Impayés imputables Monext","2021-06-22","MC","SAS MONEXT PDP",269,25,1,"54","CRE 40","14","000000","X1","17028","17028","XA","PPT","    ","03","07",3,"17028","92282","513264KHYODHNJ31350","20210621",{"$f":"VLOOKUP(G47,'Listes déroulantes'!G:I,3,FALSE)","v":"50318500100032 "},"0000000000026900","978","2","IM ","I","           af2342567930","FAC","20210622",{"$f":"VLOOKUP(G47,'Listes déroulantes'!G:O,9,FALSE)","v":"260 RUE CLAUDE NICOL"},"13","FRA",{"$f":"VLOOKUP(G47,'Listes déroulantes'!G:H,2,FALSE)","v":"SAS MONEXT          "},428648970610,"54",1,"17028","92282",{"$f":"VLOOKUP(G47,'Listes déroulantes'!G:N,8,FALSE)","v":"20289045644"},"93","001","      ",{"$f":"VLOOKUP(G47,'Listes déroulantes'!G:J,4,FALSE)","v":"9255001   "},"   ","                                  ","EUR","02","0000000000026800","LMA-17028-I-2105-0042",{"$f":"VLOOKUP(G47,'Listes déroulantes'!G:M,7,FALSE)","v":"MONEXT                  "},"220621","000000","     ","0000000000026900","0000000000026900"," ","    ","        ","000000000000","000000000100"," ","00000","4643216546131356461","20210622","000042","                         ","                                                                                                                                                                        ","000000002500","                                                                                                                                                                                                                                                                                                                                "]
["Enregistrement 41","NON","CRE NON ACTIF","Impayés imputables Monext","2021-06-22","MC","SAS MONEXT PDP",270,25,1,"55","CRE 41","14","000000","X1","17028","17028","XA","PPT","    ","03","07",3,"17028","92282","513264KHYODHNJ31351","20210621",{"$f":"VLOOKUP(G48,'Listes déroulantes'!G:I,3,FALSE)","v":"50318500100032 "},"0000000000027000","978","2","IM ","I","           af2342567931","FAC","20210622",{"$f":"VLOOKUP(G48,'Listes déroulantes'!G:O,9,FALSE)","v":"260 RUE CLAUDE NICOL"},"13","FRA",{"$f":"VLOOKUP(G48,'Listes déroulantes'!G:H,2,FALSE)","v":"SAS MONEXT          "},428648970611,"55",1,"17028","92282",{"$f":"VLOOKUP(G48,'Listes déroulantes'!G:N,8,FALSE)","v":"20289045644"},"93","001","      ",{"$f":"VLOOKUP(G48,'Listes déroulantes'!G:J,4,FALSE)","v":"9255001   "},"   ","                                  ","EUR","02","0000000000026900","LMA-17028-I-2105-0043",{"$f":"VLOOKUP(G48,'Listes déroulantes'!G:M,7,FALSE)","v":"MONEXT                  "},"220621","000000","     ","0000000000027000","0000000000027000"," ","    ","        ","000000000000","000000000100"," ","00000","4643216546131356461","20210622","000043",{"$f":"\"                         \"","v":"                         "},"                                                                                                                                                                        ","000000002500","                                                                                                                                                                                                                                                                                                                                "]

{"sheet":"Listes déroulantes","index":6,"n_rows":179,"n_cols":23,"rows_kept":179,"cut":false,"hidden":false,"merged":[]}
[null,null,null,null,null,null,null,"OBLIGATOIRE POUR CRE","OBLIGATOIRE POUR CRE","OBLIGATOIRE POUR CRE","OBLIGATOIRE POUR CRE","OBLIGATOIRE POUR CRE","OBLIGATOIRE POUR CRE","OBLIGATOIRE POUR CRE","OBLIGATOIRE POUR CRE"]
["Info primaire","Info primaire",null,"Info primaire","Info primaire","Info primaire","Info primaire","Déduit de commerçant","Déduit de commerçant","Déduit de commerçant","Déduit de commerçant","Déduit de commerçant","Déduit de commerçant","Déduit de commerçant","Déduit de commerçant","Déduit de commerçant","Déduit de commerçant","Déduit de commerçant","Déduit de commerçant","Déduit de commerçant",null,"Info primaire actu ","Info primaire actu "]
[null,null,null,null,null,null,null,"Doit etre sur 20 caractères","Doit etre sur 15 caractères","Doit etre sur 10 caractères","Doit etre sur 7 caractères","Doit etre sur 5 caractères","Doit etre sur 24 caractères","Doit etre sur 11 caractères","Doit etre sur 20 caractères",{"$f":"LEN(P5)","v":10},11,27,27,8,1]
["Type opération","Réseau","Devise","Nature carte","Type carte","Zone Geo","Commerçant","Raison sociale","SIRET","Contrat primo","Contrat secondo","TYPAPPLI","Nom du commerçant ","Numéro de compte du rib","Adresse","ACCOUNT_ID","BIC","EXTERNAL_IBAN","INTERNAL_IBAN","CEGID_ID","MODE DE VIREMENT","ROLLING RESERVE","CASHOUT"]
["Payment","VISA","EUR","Débit","Particulier","FRA","SAS MONEXT PDPSC","SAS MONEXT          ","50318500100032 ","9255001   ",4319212,"PDPSC","MONEXT                  ","20289045644","260 RUE CLAUDE NICOL","DC06983215","CMBRFR2BARK","FR7615589297530028192724052","FR7617028922820289045644093","C0009999","A","0.00","Oui"]
["Refund","MC","USD","Crédit","Entreprise","UE ","SAS MONEXT PDP","SAS MONEXT          ","50318500100032 ","9255001   ",4319211,"PDP  ","MONEXT                  ","20289045644","260 RUE CLAUDE NICOL","DC06983215","CMBRFR2BARK","FR7615589297530028192724052","FR7617028922820289045644093","C0009999","A","0.00","Non"]
["PaymentChargeback","CB",null,"Prépayé"," ","HUE","SARL LOVINO PDP","SARL LOVINO         ","53152017900023 ","9255002   ",4319376,"PDP  ","OENODEPOT               ","05260573540","30 RUE FREDERIC JOLI","DC07063052","SMCTFR2A","FR7630077048691338980020066","FR7617028922820526057354023","C0002537","A","0.00"]
[null,null,null,null,null,"   ","SARL LOVINO  PDPSC","SARL LOVINO         ","53152017900023 ","9255002   ",4319380,"PDPSC","OENODEPOT               ","05260573540","30 RUE FREDERIC JOLI","DC07063052","SMCTFR2A","FR7630077048691338980020066","FR7617028922820526057354023","C0002537","A","0.00"]
[null,null,null," ",null,null,"SAS MONEXT  VAD","SAS MONEXT          ","50318500100032 ","9255003   ",4319585,"VAD  ","MONEXT                  ","20289045644","260 RUE CLAUDE NICOL","DC06983215","CMBRFR2BARK","FR7615589297530028192724052","FR7617028922820289045644093","C0009999","A","0.00"]
[null,null,null,null,null,null,"SARL LOVINO VAD","SARL LOVINO         ","53152017900023 ","9255004   ",4319661,"VAD  ","OENODEPOT               ","05260573540","30 RUE FREDERIC JOLI","DC07063052","SMCTFR2A","FR7630077048691338980020066","FR7617028922820526057354023","C0002537","A","0.00"]
[null,null,null,null,null,null,"GUY DEMARLE VAD","SAS GUY DEMARLE GD P","49769047900025 ","9255005   ",4319669,"VAD  ","GUY DEMARLE             ","02608442940","59 MARCQ EN BAROE   ","DC08755701","CRLYFRPPXXX","FR3830002066130000061964X41","FR761702892282026084429409","C0002718","A","0.00"]
[null,null,null,null,null,null,"Commercant_1_CM","Commercant_1_CM     ","63152017900023 ","9255101   ",4000101,"VAD  ","Commercant_1_CM         ","05260573540","666 RUE JLAUDE VANDA","DC09255101","MOXEFR22XXX","FR2617569000403334635855A94","FR7617028922820526057354023","C9255101","A"]
[null,null,null,null,null,null,"Commercant_2_CM","Commercant_2_CM     ","69769047900025 ","9255102   ",4000102,"VAD  ","Commercant_2_CM         ","02608442940","30 RUE FREDERIC JOLI","DC09255102","MOXEFR22XXX","FR9117569000503525322484O18","FR7617028922820260844294094","C9255102","M"]
[null,null,null,null,null,null,"Commercant_2_bis_CM","Commercant_2_bis_CM ","69769047990025 ","9255103   ",4000902,"VAD  ","Commercant_2_bis_CM     ","01234567890","270 RUE FAMILLE LAUR","DC09255103","MOXEFR22XXX","FR5612739000707938717628B54","FR7617028922820123456789087","C9255102","M"]
[null,null,null,null,null,null,"Commercant_3_CM","Commercant_3_CM     ","60318500100032 ","9255104   ",4000103,"VAD  ","Commercant_3_CM         ","2890456440 ","10 RUE CLAUDE NICOLA","DC09255104","MOXEFR22XXX","FR2230003000407248938177F71","FR7617028922820289045644093","C9255104","M"]
[null,null,null,null,null,null,"Commercant_3_bis_CM","Commercant_3_bis_CM ","60318500190032 ","9255105   ",4000903,"VAD  ","Commercant_3_bis_CM     ","12763862845","820 RUE ANDRE AMPERE","DC09255105","MOXEFR22XXX","FR5310096000409316698434C45","FR7617028922821276386284526","C9255104","M"]
[null,null,null,null,null,{"$f":"LEN(K17)","v":7},"CM_1_RMFEC PDPSC","CM_1_RMFEC          ","60419700180001 ","9256001   ",4100011,"PDPSC","CM_1_RMFEC PDPSC        ","28293060123","13 FAUBOURG FIGUEROL","DC9256001 ","MOXEFR22XXX","FR5310096000409316698434C46","FR7617028922821276386284527","C9256001","A","200.00","Oui"]
[null,null,null,null,null,{"$f":"LEN(K18)","v":7},"CM_1_RMFEC PDP ","CM_1_RMFEC          ","60419700180001 ","9256001   ",4100012,"PDP  ","CM_1_RMFEC PDP          ","28293060123","13 FAUBOURG FIGUEROL","DC9256001 ","MOXEFR22XXX","FR5310096000409316698434C46","FR7617028922821276386284527","C9256001","A","200.00","Oui"]
[null,null,null,null,null,7,"CM_1_RMFEC VAD","CM_1_RMFEC          ","60419700180001 ","9256002   ",4100013,"VAD  ","CM_1_RMFEC VAD          ","28293060123","13 FAUBOURG FIGUEROL","DC9256001 ","MOXEFR22XXX","FR5310096000409316698434C46","FR7617028922821276386284527","C9256001","A","200.00","Oui"]
[null,null,null,null,null,7,"CM_2_RMFEC PDP","CM_2_RMFEC          ","60519700180001 ","9256003   ",4100021,"PDP  ","CM_2_RMFEC PDP          ","28293060124","25 RUE CARNOT       ","DC9256002 ","MOXEFR22XXX","FR5310096000409316698434C49","FR7617028922821276386284528","C9256002","A","200.00","Oui"]
[null,null,null,null,null,7,"CM_2_RMFEC VAD","CM_2_RMFEC          ","60519700180001 ","9256004   ",4100022,"VAD  ","CM_2_RMFEC VAD          ","28293060124","25 RUE CARNOT       ","DC9256002 ","MOXEFR22XXX","FR5310096000409316698434C49","FR7617028922821276386284528","C9256002","A","200.00","Oui"]
[null,null,null,null,{"$f":"LEN(S21)","v":27},7,"CM_3_RMFEC VAD","CM_3_RMFEC          ","60619700180001 ","9256005   ",4100031,"VAD  ","CM_3_RMFEC VAD          ","28293060125","50 RUE DE PALAVAS   ","DC9256003 ","MOXEFR22XXX","FR5310096000409316698434C51","FR7617028922821276386284529","C9256003","A","200.00","Oui"]
[null,null,null,null,{"$f":"LEN(S22)","v":27},7,"CM_4_RMFEC PDPSC","CM_4_RMFEC          ","60719700180001 ","9256006   ",4100041,"PDPSC","CM_4_RMFEC PDPSC        ","28293060126","20 AVENUE DE TOULOUS","DC9256004 ","MOXEFR22XXX","FR5310096000409316698434C52","FR7617028922821276386284530","C9256004","A","200.00","Oui"]
[null,null,null,null,null,7,"CM_4_RMFEC PDP ","CM_4_RMFEC          ","60719700180001 ","9256006   ",4100042,"PDP  ","CM_4_RMFEC PDP          ","28293060126","20 AVENUE DE TOULOUS","DC9256004 ","MOXEFR22XXX","FR5310096000409316698434C52","FR7617028922821276386284530","C9256004","A","200.00","Oui"]
[null,null,null,null,null,7,"CM_4_RMFEC VAD","CM_4_RMFEC          ","60719700180001 ","9256007   ",4100043,"VAD  ","CM_4_RMFEC VAD          ","28293060126","20 AVENUE DE TOULOUS","DC9256004 ","MOXEFR22XXX","FR5310096000409316698434C52","FR7617028922821276386284530","C9256004","A","200.00","Oui"]
[null,null,null,null,null,7,"CM_5_RMFEC PDP","CM_5_RMFEC          ","60819700180001 ","9256008   ",4100051,"PDP  ","CM_5_RMFEC PDP          ","28293060127","43 RUE CLEMENCE     ","DC9256005 ","MOXEFR22XXX","FR5310096000409316698434C55","FR7617028922821276386284531","C9256005","A","200.00","Oui"]
[null,null,null,null,null,7,"CM_5_RMFEC VAD","CM_5_RMFEC          ","60819700180001 ","9256009   ",4100052,"VAD  ","CM_5_RMFEC VAD          ","28293060127","43 RUE CLEMENCE     ","DC9256005 ","MOXEFR22XXX","FR5310096000409316698434C55","FR7617028922821276386284531","C9256005","A","200.00","Oui"]
[null,null,null,null,null,7,"CM_6_RMFEC VAD","CM_6_RMFEC          ","60919700180001 ","9256010   ",4100062,"VAD  ","CM_6_RMFEC VAD          ","28293060128","20 RUE JEAN JAURES  ","DC9256006 ","MOXEFR22XXX","FR5310096000409316698434C57","FR7617028922821276386284532","C9256006","A","200.00","Oui"]
[null,null,null,null,null,null,"CM_7_RMFEC PDPSC","CM_7_RMFEC          ","60920700180001 ","9256011   ",4100071,"PDPSC","CM_7_RMFEC PDPSC        ","28293060129","20 RUE CARDINALE    ","DC92560007","MOXEFR22XXX","FR5310096000409316698434C58","FR7617028922821276386284533","C9256007","A","200.00","Oui"]
[null,null,null,null,null,null,"CM_7_RMFEC PDP ","CM_7_RMFEC          ","60920700180001 ","9256011   ",4100072,"PDP  ","CM_7_RMFEC PDP          ","28293060129","20 RUE CARDINALE    ","DC92560007","MOXEFR22XXX","FR5310096000409316698434C58","FR7617028922821276386284533","C9256007","A","200.00","Oui"]
[null,null,null,null,null,null,"CM_7_RMFEC VAD","CM_7_RMFEC          ","60920700180001 ","9256012   ",4100073,"VAD  ","CM_7_RMFEC VAD          ","28293060129","20 RUE CARDINALE    ","DC92560007","MOXEFR22XXX","FR5310096000409316698434C58","FR7617028922821276386284533","C9256007","A","200.00","Oui"]
[null,null,null,null,null,null,"CM_8_RMFEC PDP","CM_8_RMFEC          ","60921700180001 ","9256013   ",4100081,"PDP  ","CM_8_RMFEC PDP          ","28293060130","10 RUE SALLIER      ","DC92560008","MOXEFR22XXX","FR5310096000409316698434C59","FR7617028922821276386284534","C9256008","A","200.00","Oui"]
[null,null,null,null,null,null,"CM_8_RMFEC VAD","CM_8_RMFEC          ","60921700180001 ","9256014   ",4100082,"VAD  ","CM_8_RMFEC VAD          ","28293060130","10 RUE SALLIER      ","DC92560008","MOXEFR22XXX","FR5310096000409316698434C59","FR7617028922821276386284534","C9256008","A","200.00","Oui"]
[null,null,null,null,null,null,"CM_9_RMFEC VAD","CM_9_RMFEC          ","60922700180001 ","9256015   ",4100083,"VAD  ","CM_9_RMFEC VAD          ","28293060131","50 RUE MAZARINE     ","DC92560009","MOXEFR22XXX","FR5310096000409316698434C60","FR7617028922821276386284535","C9256009","A","200.00","Oui"]
[null,null,null,null,null,null,"CM_10_RMFEC PDPSC","CM_10_RMFEC         ","60923700180001 ","9256016   ",4101101,"PDPSC","CM_10_RMFEC PDPSC       ","28293060132","1 RUE AUDE          ","DC92560010","MOXEFR22XXX","FR5310096000409316698434C61","FR7617028922821276386284536","C9256010","A","200.00","Oui"]
[null,null,null,null,null,null,"CM_10_RMFEC PDP ","CM_10_RMFEC         ","60923700180001 ","9256016   ",4101102,"PDP  ","CM_10_RMFEC PDP         ","28293060132","1 RUE AUDE          ","DC92560010","MOXEFR22XXX","FR5310096000409316698434C61","FR7617028922821276386284536","C9256010","A","200.00","Oui"]
[null,null,null,null,null,null,"CM_10_RMFEC VAD","CM_10_RMFEC         ","60923700180001 ","9256017   ",4101103,"VAD  ","CM_10_RMFEC VAD         ","28293060132","1 RUE AUDE          ","DC92560010","MOXEFR22XXX","FR5310096000409316698434C61","FR7617028922821276386284536","C9256010","M","200.00","Oui"]
[null,null,null,null,null,null,"CM_11_RMFEC PDP","CM_11_RMFEC         ","60924700180001 ","9256018   ",4101111,"PDP  ","CM_11_RMFEC PDP         ","28293060133","50 RUE MONCLAR      ","DC92560011","MOXEFR22XXX","FR5310096000409316698434C62","FR7617028922821276386284537","C9256011","A","200.00","Oui"]
[null,null,null,null,null,null,"CM_11_RMFEC VAD","CM_11_RMFEC         ","60924700180001 ","9256019   ",4101112,"VAD  ","CM_11_RMFEC VAD         ","28293060133","50 RUE MONCLAR      ","DC92560011","MOXEFR22XXX","FR5310096000409316698434C62","FR7617028922821276386284537","C9256011","A","200.00","Oui"]
[null,null,null,null,null,null,"CM_12_RMFEC VAD","CM_12_RMFEC         ","60925700180001 ","9256020   ",4101121,"VAD  ","CM_12_RMFEC VAD         ","28293060134","8 RUE LOUBET        ","DC92560012","MOXEFR22XXX","FR5310096000409316698434C63","FR7617028922821276386284538","C9256012","A","200.00","Oui"]
[null,null,null,null,null,null,"CM_12_RMFEC VAD2","CM_12_RMFEC         ","60925700180001 ","9256120   ",4101122,"VAD  ","CM_12_2RMFEC VAD        ","28293060134","8 RUE LOUBET        ","DC92560012","MOXEFR22XXX","FR5310096000409316698434C63","FR7617028922821276386284538","C9256012","A","200.00","Oui"]
[null,null,null,null,null,null,"CM_13_RMFEC PDPSC","CM_13_RMFEC         ","60926700180001 ","9256021   ",4101131,"PDPSC","CM_13_RMFEC PDPSC       ","28293060134","15 RUE DE RETHEL    ","DC92560013","MOXEFR22XXX","FR5310096000409316698434C64","FR7617028922821276386284539","C9256013","A","200.00","Oui"]
[null,null,null,null,null,null,"CM_13_RMFEC PDP ","CM_13_RMFEC         ","60926700180001 ","9256021   ",4101132,"PDP  ","CM_13_RMFEC PDP         ","28293060134","15 RUE DE RETHEL    ","DC92560013","MOXEFR22XXX","FR5310096000409316698434C64","FR7617028922821276386284539","C9256013","A","200.00","Oui"]
[null,null,null,null,null,null,"CM_13_RMFEC VAD","CM_13_RMFEC         ","60926700180001 ","9256022   ",4101133,"VAD  ","CM_13_RMFEC VAD         ","28293060134","15 RUE DE RETHEL    ","DC92560013","MOXEFR22XXX","FR5310096000409316698434C64","FR7617028922821276386284539","C9256013","A","200.00","Oui"]
[null,null,null,null,null,null,"CM_14_RMFEC PDP","CM_14_RMFEC         ","60927700180001 ","9256023   ",4101141,"PDP  ","CM_14_RMFEC PDP         ","28293060135","132 RUE VINCENT EUVR","DC92560014","MOXEFR22XXX","FR5310096000409316698434C65","FR7617028922821276386284540","C9256014","A","200.00","Oui"]
[null,null,null,null,null,null,"CM_14_RMFEC VAD","CM_14_RMFEC         ","60927700180001 ","9256024   ",4101142,"VAD  ","CM_14_RMFEC VAD         ","28293060135","132 RUE VINCENT EUVR","DC92560014","MOXEFR22XXX","FR5310096000409316698434C65","FR7617028922821276386284540","C9256014","A","200.00","Non"]
[null,null,null,null,null,null,"CM_15_RMFEC VAD","CM_15_RMFEC         ","60928700180001 ","9256025   ",4101151,"VAD  ","CM_15_RMFEC VAD         ","28293060136","5 RUE DU POIDS DU RO","DC92560015","MOXEFR22XXX","FR5310096000409316698434C66","FR7617028922821276386284541","C9256015","M","200.00","Non"]
[null,null,null,null,null,null,"CM_16_RMFEC PDPSC","CM_16_RMFEC         ","60929700180001 ","9256026   ",4101161,"PDPSC","CM_16_RMFEC PDPSC       ","28293060137","27 AVENUE DE LA CROI","DC92560016","MOXEFR22XXX","FR5310096000409316698434C67","FR7617028922821276386284542","C9256016","A","200.00","Oui"]
[null,null,null,null,null,null,"CM_16_RMFEC PDP ","CM_16_RMFEC         ","60929700180001 ","9256026   ",4101162,"PDP  ","CM_16_RMFEC PDP         ","28293060137","27 AVENUE DE LA CROI","DC92560016","MOXEFR22XXX","FR5310096000409316698434C67","FR7617028922821276386284542","C9256016","A","200.00","Oui"]
[null,null,null,null,null,null,"CM_16_RMFEC VAD","CM_16_RMFEC         ","60929700180001 ","9256027   ",4101163,"VAD  ","CM_16_RMFEC VAD         ","28293060137","27 AVENUE DE LA CROI","DC92560016","MOXEFR22XXX","FR5310096000409316698434C67","FR7617028922821276386284542","C9256016","A","200.00","Oui"]
[null,null,null,null,null,null,"CM_16_RMFEC VAD2","CM_16_RMFEC         ","60929700180001 ","9256127   ",4101164,"VAD  ","CM_16_RMFEC VAD         ","28293060137","27 AVENUE DE LA CROI","DC92560016","MOXEFR22XXX","FR5310096000409316698434C67","FR7617028922821276386284542","C9256016","A","200.00","Oui"]
[null,null,null,null,null,null,"CM_17_RMFEC PDP","CM_17_RMFEC         ","60930700180001 ","9256028   ",4101171,"PDP  ","CM_17_RMFEC PDP         ","28293060138","78 RUE DE LA FIGAIRA","DC92560017","MOXEFR22XXX","FR5310096000409316698434C68","FR7617028922821276386284543","C9256017","A","200.00","Oui"]
[null,null,null,null,null,null,"CM_17_RMFEC VAD","CM_17_RMFEC         ","60930700180001 ","9256029   ",4101172,"VAD  ","CM_17_RMFEC VAD         ","28293060138","78 RUE DE LA FIGAIRA","DC92560017","MOXEFR22XXX","FR5310096000409316698434C68","FR7617028922821276386284543","C9256017","A","200.00","Oui"]
[null,null,null,null,null,null,"CM_18_RMFEC VAD","CM_18_RMFEC         ","60931700180001 ","9256030   ",4101181,"VAD  ","CM_18_RMFEC VAD         ","28293060139","16 RUE DE LA CANTAPE","DC92560018","MOXEFR22XXX","FR5310096000409316698434C69","FR7617028922821276386284544","C9256018","A","200.00","Oui"]
[null,null,null,null,null,null,"AROMA ZONE      ","     HYTECK         ","33480650200020 ","9255011   ",4319699,"VAD  ","     HYTECK             ","01997312340","25 RUE DE L'ECOLE DE","DC09399672","BNUGFR21   ","FR7613489044521196950020020","FR7617028922820199731234035","C0002813","A","60000.00","Oui"]
[null,null,null,null,null,null,"CM_20  VAD                         ","CM_20               ","60932700180001 ","9256031   ",4101182,"VAD  ","CM_20                   ","28293060140","20 RUE DES FLEURS   ","DC92560020","MOXEFR22XXX","FR5310096000409316698434C70","FR7617028922821276386284545","C9256020","A","200.00","Oui"]
[null,null,null,null,null,null,"CM_21  VAD                       ","CM_21               ","60933700180001 ","9256032   ",4101183,"VAD  ","CM_21                   ","28293060141","21 RUE DES FLEURS   ","DC92560021","MOXEFR22XXX","FR5310096000409316698434C71","FR7617028922821276386284546","C9256021","A","200.00","Oui"]
[null,null,null,null,null,null,"CM_22  VAD                         ","CM_22               ","60934700180001 ","9256033   ",4101184,"VAD  ","CM_22                   ","28293060142","22 RUE DES FLEURS   ","DC92560022","MOXEFR22XXX","FR5310096000409316698434C72","FR7617028922821276386284547","C9256022","A","200.00","Oui"]
[null,null,null,null,null,null,"CM_23  VAD                       ","CM_23               ","60935700180001 ","9256034   ",4101185,"VAD  ","CM_23                   ","28293060143","23 RUE DES FLEURS   ","DC92560023","MOXEFR22XXX","FR5310096000409316698434C73","FR7617028922821276386284548","C9256023","M","200.00","Oui"]
[null,null,null,null,null,null,"CM_24  VAD                         ","CM_24               ","60936700180001 ","9256035   ",4101186,"VAD  ","CM_24                   ","28293060144","24 RUE DES FLEURS   ","DC92560024","MOXEFR22XXX","FR5310096000409316698434C74","FR7617028922821276386284549","C9256024","M","200.00","Oui"]
[null,null,null,null,null,null,"CM_24b_VAD","CM_24b              ","60936700190001 ","9256036   ",4101187,"VAD  ","CM_24b                  ","28293060145","24 RUE DES FLEURS   ","DC92560025","MOXEFR22XXX","FR5310096000409316698434C75","FR7617028922821276386284550","C9256025","M",0,"Oui"]
[null,null,null,null,null,null,"CM_26  VAD                         ","CM_26               ","60937700180001 ","9256037   ",4101189,"VAD  ","CM_26                   ","28293060146","26 RUE DES FLEURS   ","DC92560026","MOXEFR22XXX","FR5310096000409316698434C76","FR7617028922821276386284551","C9256026","A","200.00","Oui"]
[null,null,null,null,null,null,"CM_27  VAD                       ","CM_27               ","60938700180001 ","9256038   ",4101189,"VAD  ","CM_27                   ","28293060147","27 RUE DES FLEURS   ","DC92560027","MOXEFR22XXX","FR5310096000409316698434C77","FR7617028922821276386284552","C9256027","M","200.00","Oui"]
[null,null,null,null,null,null,"CM_32_VAD","CM_32               ","60903200190001 ","9556032   ",4102032,"VAD  ","CM_32                   ","28293060232","32 RUE DU TEST      ","DC96560032","MOXEFR22XXX","FR5310096000409316698435C32","FR7617028922821276386284632","C9656032","A","200.00","Oui"]
[null,null,null,null,null,null,"CM_33_PDP","CM_33               ","60903300190001 ","9556033   ",4102033,"PDP  ","CM_33                   ","28293060233","33 RUE DU TEST      ","DC96560033","MOXEFR22XXX","FR5310096000409316698435C33","FR7617028922821276386284633","C9656033","A","200.00","Oui"]
[null,null,null,null,null,null,"CM_34_AG1","CM_34_AG1           ","60903400190001 ","9556034   ",4102034,"VAD  ","CM_34                   ","28293060234","34 RUE DU TEST      ","DC96560034","MOXEFR22XXX","FR5310096000409316698435C34","FR7617028922821276386284634","C9656034","A","200.00","Oui"]
[null,null,null,null,null,null,"CM_35_AG2","CM_35_AG2           ","60903500190001 ","9556035   ",4102035,"PDP  ","CM_35                   ","28293060235","35 RUE DU TEST      ","DC96560035","MOXEFR22XXX","FR5310096000409316698435C35","FR7617028922821276386284635","C9656035","A","0.00","Oui"]
[null,null,null,null,null,null,"CM_36_PDPAG1","CM_36               ","60903600190001 ","9556036   ",4102036,"PDP  ","CM_36                   ","28293060236","36 RUE DU TEST      ","DC96560036","MOXEFR22XXX","FR5310096000409316698435C36","FR7617028922821276386284636","C9656036","A","200.00","Oui"]
[null,null,null,null,null,null,"CM_37_VADAG1","CM_37               ","60903700190001 ","9556037   ",4102037,"VAD  ","CM_37                   ","28293060237","37 RUE DU TEST      ","DC96560037","MOXEFR22XXX","FR5310096000409316698435C37","FR7617028922821276386284637","C9656037","A","200.00","Oui"]
[null,null,null,null,null,null,"CM_38_PDPAG1","CM_38               ","60903800190001 ","9556038   ",4102038,"PDP  ","CM_38                   ","28293060238","38 RUE DU TEST      ","DC96560038","MOXEFR22XXX","FR5310096000409316698435C38","FR7617028922821276386284638","C9656038","A","200.00","Oui"]
[null,null,null,null,null,null,"CM_39_PDPAG2","CM_39               ","60903900190001 ","9556039   ",4102039,"PDP  ","CM_39                   ","28293060239","39 RUE DU TEST      ","DC96560039","MOXEFR22XXX","FR5310096000409316698435C39","FR7617028922821276386284639","C9656039","A","200.00","Oui"]
[null,null,null,null,null,null,"CM_40_VADAG2","CM_40               ","60904000190001 ","9556040   ",4102040,"VAD  ","CM_40                   ","28293060240","40 RUE DU TEST      ","DC96560040","MOXEFR22XXX","FR5310096000409316698435C40","FR7617028922821276386284640","C9656040","A","200.00","Oui"]
[null,null,null,null,null,null,"CM_41_PDPAG2","CM_41               ","60904100190001 ","9556041   ",4102041,"PDP  ","CM_41                   ","28293060241","41 RUE DU TEST      ","DC96560041","MOXEFR22XXX","FR5310096000409316698435C41","FR7617028922821276386284641","C9656041","A","0.00","Oui"]
[null,null,null,null,null,null,"CM_01  ","CM_01_COA/C         ","60992700180001 ","9356031   ",4111181,"VAD  ","CM_01                   ","28293060140","1 RUE DES FLEURS    ","DC92570021","MOXEFR22XXX","FR5310096000409316698434C70","FR7617028922821276386284526","C9256100","A",200,"Oui"]
[null,null,null,null,null,null,"CM_02","CM_02_COA/C         ","60992700180002 ","9356032   ",4111182,"VAD  ","CM_02                   ","28293060141","2 RUE DES FLEURS    ","DC92570022","MOXEFR22XXX","FR5310096000409316698434C71","FR7617028922822276386284573","C9256200","A",200,"Oui"]
[null,null,null,null,null,null,"CM_03","CM_03_COM/C         ","60992700180003 ","9356033   ",4111183,"PDP  ","CM_03                   ","28293060142","3 RUE DES FLEURS    ","DC92570023","MOXEFR22XXX","FR5310096000409316698434C72","FR7617028922823276386284523","C9256300","M",200,"Oui"]
[null,null,null,null,null,null,"CM_04","CM_04_COA/C         ","60992700180004 ","9356034   ",4111184,"VAD  ","CM_04                   ","28293060143","4 RUE DES FLEURS    ","DC92570024","MOXEFR22XXX","FR5310096000409316698434C73","FR7617028922824276386284570","C9256400","A",200,"Oui"]
[null,null,null,null,null,null,"CM_05","CM_05_COA/M         ","60992700180005 ","9356035   ",4111185,"VAD  ","CM_05                   ","28293060144","5 RUE DES FLEURS    ","DC92570025","MOXEFR22XXX","FR5310096000409316698434C74","FR7617028922825276386284520","C9256500","A",200,"Oui"]
[null,null,null,null,null,null,"CM_06","CM_06 _COA/M        ","60992700180006 ","9356036   ",4111186,"VAD  ","CM_06                   ","28293060145","6 RUE DES FLEURS    ","DC92570026","MOXEFR22XXX","FR5310096000409316698434C75","FR7617028922826276386284567","C9256600","A",200,"Oui"]
[null,null,null,null,null,null,"CM_07","CM_07_COA/C         ","60992700180007 ","9356037   ",4111187,"VAD  ","CM_07                   ","28293060132","7 RUE DES FLEURS    ","DC92570027","MOXEFR22XXX","FR5310096000409316698434C61","FR7617028922827276386284517","C9256700","A",200,"Oui"]
[null,null,null,null,null,null,"CM_08","CM_08_COA/C/CL1AG1  ","60992700180008 ","9356038   ",4111188,"PDP  ","CM_08                   ","28293060134","8 RUE DES FLEURS    ","DC92570028","MOXEFR22XXX","FR5310096000409316698434C63","FR7617028922828276386284564","C9256800","A",50,"Oui"]
[null,null,null,null,null,null,"CM_09","CM_09_COA/C/CL2AG1  ","60992700180009 ","9356039   ",4111189,"PDP  ","CM_09                   ","28293060134","9 RUE DES FLEURS    ","DC92570029","MOXEFR22XXX","FR5310096000409316698434C63","FR7617028922829276386284514","C9256900","A",50,"Oui"]
[null,null,null,null,null,null,"CM_10","CM_10_COM/C         ","60992700180010 ","9356040   ",4111190,"VAD  ","CM_10                   ","28293060135","10 RUE DES FLEURS   ","DC92570030","MOXEFR22XXX","FR5310096000409316698434C65","FR7617028922821076386284536","C9256100","M",50,"Oui"]
[null,null,null,null,null,null,"CM_11","CM_11_AG1           ","60992700180011 ","9356051   ",4111191,"VAD  ","CM_11                   ","28293060136","11 RUE DES FLEURS   ","DC92570031","MOXEFR22XXX","FR5310096000409316698434C66","FR7617028922821176386284531","C9256110","M",0,"Oui"]
[null,null,null,null,null,null,"Autres à créer",{"$f":"LEN(H74)","v":20},{"$f":"LEN(I74)","v":15},{"$f":"LEN(J74)","v":10},7,5,24,11,20,10,11,27,27,8,1]
[null,null,null,null,null,null,"Autres à créer",{"$f":"LEN(H75)","v":20},15,10,7,5,24,11,20,10,11,27,27,8,1]
[null,null,null,null,null,null,"Autres à créer",{"$f":"LEN(H76)","v":20},15,{"$f":"LEN(J76)","v":10},7,5,24,11,20,10,11,27,27,8,1]
[null,null,null,null,null,null,"Autres à créer",{"$f":"LEN(H77)","v":20},15,10,7,5,24,11,20,10,11,27,27,8,1]
[null,null,null,null,null,null,"Autres à créer",{"$f":"LEN(H78)","v":20},15,10,7,5,24,11,20,10,11,27,27,8,1]
[null,null,null,null,null,null,"Autres à créer",{"$f":"LEN(H79)","v":20},15,10,7,5,24,11,20,10,11,27,27,8,1]
[null,null,null,null,null,null,"Autres à créer",{"$f":"LEN(H80)","v":20},15,10,7,5,24,11,{"$f":"LEN(O80)","v":20},10,11,27,27,8,1]
[null,null,null,null,null,null,"Autres à créer",{"$f":"LEN(H81)","v":20},15,10,7,5,24,11,20,10,11,27,27,8,1]
[null,null,null,null,null,null,"Autres à créer",{"$f":"LEN(H82)","v":20},15,10,7,5,24,11,20,10,11,27,27,8,1]
[null,null,null,null,null,null,"Autres à créer",{"$f":"LEN(H83)","v":20},15,10,7,5,24,11,20,10,11,27,27,8,1]
[null,null,null,null,null,null,"Autres à créer",{"$f":"LEN(H84)","v":20},15,10,7,5,24,11,20,10,11,27,27,8,1]
[null,null,null,null,null,null,"Autres à créer",{"$f":"LEN(H85)","v":2},2,2,1,1,2,2,2,2,2,2,2,1,1]
[null,null,null,null,null,null,"Autres à créer",{"$f":"LEN(H86)","v":2},2,2,1,1,2,2,2,2,2,2,2,1,1]
[null,null,null,null,null,null,"Autres à créer",{"$f":"LEN(H87)","v":2},2,2,1,1,2,2,2,2,2,2,2,1,1]
[null,null,null,null,null,null,"Autres à créer"]
[null,null,null,null,null,null,"Autres à créer"]
[null,null,null,null,null,null,"Autres à créer"]
[null,null,null,null,null,null,"Autres à créer"]
[null,null,null,null,null,null,"Autres à créer"]
[null,null,null,null,null,null,"Autres à créer"]
[null,null,null,null,null,null,"Autres à créer"]
[null,null,null,null,null,null,"Autres à créer"]
[null,null,null,null,null,null,"Autres à créer"]
[null,null,null,null,null,null,"Autres à créer"]
[null,null,null,null,null,null,"Autres à créer"]
[null,null,null,null,null,null,"Autres à créer"]
[null,null,null,null,null,null,"Autres à créer"]
[null,null,null,null,null,null,"Autres à créer"]
[null,null,null,null,null,null,"Autres à créer"]
[null,null,null,null,null,null,"Autres à créer"]
[null,null,null,null,null,null,"Autres à créer"]
[null,null,null,null,null,null,"Autres à créer"]
[null,null,null,null,null,null,"Autres à créer"]
[null,null,null,null,null,null,"Autres à créer"]
[null,null,null,null,null,null,"Autres à créer"]
[null,null,null,null,null,null,"Autres à créer"]
[null,null,null,null,null,null,"Autres à créer"]
[null,null,null,null,null,null,"Autres à créer"]
[null,null,null,null,null,null,"Autres à créer"]
[null,null,null,null,null,null,"Autres à créer"]
[null,null,null,null,null,null,"Autres à créer"]
[null,null,null,null,null,null,"Autres à créer"]
[null,null,null,null,null,null,"Autres à créer"]
[null,null,null,null,null,null,"Autres à créer"]
[null,null,null,null,null,null,"Autres à créer"]
[null,null,null,null,null,null,"Autres à créer"]
[null,null,null,null,null,null,"Autres à créer"]
[null,null,null,null,null,null,"Autres à créer"]
[null,null,null,null,null,null,"Autres à créer"]
[null,null,null,null,null,null,"Autres à créer"]
[null,null,null,null,null,null,"Autres à créer"]
[null,null,null,null,null,null,"Autres à créer"]
[null,null,null,null,null,null,"Autres à créer"]
[null,null,null,null,null,null,"Autres à créer"]
[null,null,null,null,null,null,"Autres à créer"]
[null,null,null,null,null,null,"Autres à créer"]
[null,null,null,null,null,null,"Autres à créer"]
[null,null,null,null,null,null,"Autres à créer"]
[null,null,null,null,null,null,"Autres à créer"]
[null,null,null,null,null,null,"Autres à créer"]
[null,null,null,null,null,null,"Autres à créer"]
[null,null,null,null,null,null,"Autres à créer"]
[null,null,null,null,null,null,"Autres à créer"]
[null,null,null,null,null,null,"Autres à créer"]
[null,null,null,null,null,null,"Autres à créer"]
[null,null,null,null,null,null,"Autres à créer"]
[null,null,null,null,null,null,"Autres à créer"]
[null,null,null,null,null,null,"Autres à créer"]
[null,null,null,null,null,null,"Autres à créer"]
[null,null,null,null,null,null,"Autres à créer"]
[null,null,null,null,null,null,"Autres à créer"]
[null,null,null,null,null,null,"Autres à créer"]
[null,null,null,null,null,null,"Autres à créer"]
[null,null,null,null,null,null,"Autres à créer"]
[null,null,null,null,null,null,"Autres à créer"]
[null,null,null,null,null,null,"Autres à créer"]
[null,null,null,null,null,null,"Autres à créer"]
[null,null,null,null,null,null,"Autres à créer"]
[null,null,null,null,null,null,"Autres à créer"]
[null,null,null,null,null,null,"Autres à créer"]
[null,null,null,null,null,null,"Autres à créer"]
[null,null,null,null,null,null,"Autres à créer"]
[null,null,null,null,null,null,"Autres à créer"]
[null,null,null,null,null,null,"Autres à créer"]
[null,null,null,null,null,null,"Autres à créer"]
[null,null,null,null,null,null,"Autres à créer"]
[null,null,null,null,null,null,"Autres à créer"]
[null,null,null,null,null,null,"Autres à créer"]
[null,null,null,null,null,null,"Autres à créer"]
[null,null,null,null,null,null,"Autres à créer"]
[null,null,null,null,null,null,"Autres à créer"]
[null,null,null,null,null,null,"Autres à créer"]
[null,null,null,null,null,null,"Autres à créer"]
[null,null,null,null,null,null,"Autres à créer"]
[null,null,null,null,null,null,"Autres à créer"]

{"sheet":"Code motif impayé","index":7,"n_rows":79,"n_cols":3,"rows_kept":79,"cut":false,"hidden":false,"merged":[]}
["Scheme","Code","Label"]
["CB","12  ","Transaction non autorisée pour un porteur de carte à autorisation systématique"]
["CB","13  ","Forçage"]
["CB","14  ","Transaction non autorisée"]
["CB","15  ","Garantie par carte, par jour, par Siret"]
["CB","16  ","Non contrôle du code confidentiel"]
["CB","17  ","Siret invalide"]
["CB","18  ","Certificat non vérifiable"]
["CB","19  ","Transaction autorisée sans certificat"]
["CB","21  ","Carte périmée "]
["CB","22  ","Présentation tardive"]
["CB","23  ","Empreinte manquante"]
["CB","25  ","Signature manquante ou non conforme"]
["CB","27  ","Facture crédit non reçue"]
["CB","28  ","Facture crédit traitée en débit"]
["CB","40  ","Carte annulée"]
["CB","41  ","Demande de documentation insatisfaite ou justificatif illisible"]
["CB","42  ","Opération dupliquée"]
["CB","43  ","Numéro de carte inexistant"]
["CB","44  ","Montant contesté "]
["CB","45  ","Transaction contestée"]
["CB","46  ","Liquidation ou redressement judiciaire de l’accepteur"]
["CB","61  ","Accepteur suspendu ou radié"]
["CB","62  ","Transaction non admise"]
["VI","30  ","services not provided or merchandise not received"]
["VI","41  ","cancelled recurring transaction"]
["VI","53  ","not as described or defective merchandise"]
["VI","57  ","fraudulent multiple transactions"]
["VI","60  ","illegible fulfilment"]
["VI","62  ","counterfeit transaction"]
["VI","70  ","card recovery bulletin, exception file, or Visa horizon negative file"]
["VI","71  ","declined authorization"]
["VI","72  ","no authorization"]
["VI","73  ","expired card"]
["VI","74  ","late presentment"]
["VI","75  ","transaction not recognized"]
["VI","76  ","incorrect currency or transaction code or domestic transaction processing violation"]
["VI","77  ","non matching account number"]
["VI","78  ","service code violation"]
["VI","80  ","incorrect transaction amount or account number"]
["VI","81  ","fraud – card present environment"]
["VI","82  ","duplicated processing"]
["VI","83  ","fraud – card absent environment"]
["VI","85  ","credit not processed"]
["VI","86  ","paid by other means"]
["VI","90  ","non receipt of cash or load transaction value at ATM or Load Device"]
["VI","93  ","merchant fraud performance program"]
["VI","96  ","transaction exceeds limited amount"]
["MC",4515,"Transaction not finalized."]
["MC",4522,"Authorization request declined"]
["MC",4801,"Requested transaction data was not received within maximum timeframe"]
["MC",4802,"Requested information illegible or missing within maximum timeframe"]
["MC",4804,"Multiple Processing, Duplicate (used only by the MasterCard® Debit Switch [MDS] for European-acquired transactions)"]
["MC",4807,"Warning Bulletin (the card was stop listed)"]
["MC",4808,"Requested/required authorization not obtained. Transaction not authorized"]
["MC",4809,"Transaction Not Reconciled(Used only by the MasterCard® Debit Switch [MDS] for European-acquired transactions)"]
["MC",4812,"Account number was not on file"]
["MC",4831,"Transaction amount differs. Incorrect transaction amount"]
["MC",4834,"Duplicate processing"]
["MC",4835,"Card not valid or expired"]
["MC",4837,"Fraudulent transaction; no cardholder authorization"]
["MC",4840,"Fraudulent processing of transaction"]
["MC",4841,"Cancelled recurring transaction"]
["MC",4842,"Late presentment"]
["MC",4846,"Correct transaction currency code was not provided"]
["MC",4847,"Fraudulent transaction; exceeds floor limit qualified limit and not authorized"]
["MC",4849,"Questionable merchant card acceptor activity"]
["MC",4850,"Credit posted as purchase"]
["MC",4853,"Cardholder Dispute Defective/Not as Described"]
["MC",4854,"Cardholder dispute not elsewhere classified (U.S. only)"]
["MC",4855,"Non-receipt of merchandise. Goods or services not delivered"]
["MC",4857,"Card-activated telephone transaction"]
["MC",4859,"Services not rendered"]
["MC",4860,"Credit not processed"]
["MC",4862,"Counterfeit transaction; magnetic stripe POS POI fraud."]
["MC",4863,"Cardholder does not recognize. Potential fraud"]
["MC",4870,"Chip Liability Shift * Reserved for intra-European use"]
["MC",4880,"Chip-Read POS Late Presentment *Valid only for Maestro POS transactions"]
["MC",4999,"Domestic Chargeback Dispute * Reserved for intra-European use"]